Benzenebutanoic acid, 4-hydroxy-, methyl ester
- Formula: C11H14O3
- Molecular weight: 194.2271
- IUPAC Standard InChIKey: UZHISWLCHOMTIO-UHFFFAOYSA-N
- CAS Registry Number: 22320-10-1
- Chemical structure:
View 3d structure (requires JavaScript / HTML 5) - Other names: Butyric acid, 4-(p-hydroxyphenyl)-, methyl ester; 4-(p-Hydroxyphenyl)butyric acid methyl ester; Methyl 4-(4-hydroxyphenyl)butanoate; 4-(4-Hydroxyphenyl)butanoic acid methyl ester

Gas phase ion energetics data

Data compiled by: Henry M. Rosenstock, Keith Draxl, Bruce W. Steiner, and John T. Herron
Ionization energy determinations
IE (eV) | Method | Reference |
---|---|---|
8.5 ± 0.2 | EI | Howe, Williams, et al., 1969 |
Appearance energy determinations
Ion | AE (eV) | Other Products | Method | Reference | Comment |
---|---|---|---|---|---|
C7H7O+ | 11.7 ± 0.2 | ? | EI | Howe, Williams, et al., 1969 | |
C8H8O+ | 10.7 ± 0.2 | ? | EI | Howe, Williams, et al., 1969 | |
C10H11O2+ | 11.2 ± 0.2 | CH3O | EI | Howe, Williams, et al., 1969 |

References

Howe, Williams, et al., 1969
Howe, I.; Williams, D.H.; Kingston, D.G.I.; Tannenbaum, H.P.,
Substituent effects in the mass spectra of some - and -substituted methyl butyrates,
J. Chem. Soc. B, 1969, 439. [all data]