Diphenylberyllium
- Formula: C12H10Be
- Molecular weight: 163.2200
- IUPAC Standard InChIKey: IAVVTXAPVCKJBU-UHFFFAOYSA-N
- CAS Registry Number: 22300-89-6
- Chemical structure:
View 3d structure (requires JavaScript / HTML 5) - Permanent link for this species. Use this link for bookmarking this species for future reference.

Gas phase thermochemistry data

Data compiled by: José A. Martinho Simões
Quantity | Value | Units | Method | Reference | Comment |
---|---|---|---|---|---|
ΔfH°gas | 303. ± 20. | kJ/mol | Review | Martinho Simões | The enthalpy of formation relies on -1271.9 ± 0.5 kJ/mol for the enthalpy of formation of BeSO4(solution) Glockling, Morrison, et al., 1973 |

Condensed phase thermochemistry data

Data compiled by: José A. Martinho Simões
Quantity | Value | Units | Method | Reference | Comment |
---|---|---|---|---|---|
ΔfH°solid | 153.4 ± 2.7 | kJ/mol | Review | Martinho Simões | The enthalpy of formation relies on -1271.9 ± 0.5 kJ/mol for the enthalpy of formation of BeSO4(solution) Glockling, Morrison, et al., 1973 |

Gas phase ion energetics data

Data compiled as indicated in comments:
LLK - Sharon G. Lias, Rhoda D. Levin, and Sherif A. Kafafi
Ionization energy determinations
IE (eV) | Method | Reference | Comment |
---|---|---|---|
9.20 ± 0.10 | EI | Glockling, Morrison, et al., 1973, 2 | LLK |
Appearance energy determinations
Ion | AE (eV) | Other Products | Method | Reference | Comment |
---|---|---|---|---|---|
BeC6H5+ | 13.4 ± 0.2 | C6H5 | EI | Glockling, Morrison, et al., 1973, 2 | LLK |

Phase change data

Data compiled by: José A. Martinho Simões
Quantity | Value | Units | Method | Reference | Comment |
---|---|---|---|---|---|
ΔsubH° | 150. ± 20. | kJ/mol | RSC | Glockling, Morrison, et al., 1973 | Please also see Tel'noi and Rabinovich, 1980. |

References

Martinho Simões
Martinho Simões, J.A.,
Private communication (see http://webbook.nist.gov/chemistry/om/). [all data]
Glockling, Morrison, et al., 1973
Glockling, F.; Morrison, R.J.; Wilson, J.W.,
J. Chem. Soc., Dalton Trans., 1973, 94.. [all data]
Glockling, Morrison, et al., 1973, 2
Glockling, F.; Morrison, R.J.; Wilson, J.W.,
Diphenylberyllium: Electron impact and calorimetric studies,
J. Chem. Soc. Dalton Trans., 1973, 94. [all data]