2(1H)Pyrimidinone,4-(dimethylamino)-1-methyl-
- Formula: C7H11N3O
- Molecular weight: 153.1817
- IUPAC Standard InChIKey: DHGBSOMRGXWRSE-UHFFFAOYSA-N
- CAS Registry Number: 2228-27-5
- Chemical structure:
View 3d structure (requires JavaScript / HTML 5) - Permanent link for this species. Use this link for bookmarking this species for future reference.

Gas phase ion energetics data

Data compiled by: Sharon G. Lias, Rhoda D. Levin, and Sherif A. Kafafi
Ionization energy determinations
IE (eV) | Method | Reference |
---|---|---|
8.7 ± 0.1 | EI | Verkin, Sukodub, et al., 1976 |

Van Den Dool and Kratz RI, non-polar column, temperature ramp

Column type | Active phase | I | Reference | Comment |
---|---|---|---|---|
Capillary | VF-5MS | 2035. | Todua, 2011 | 30. m/0.25 mm/0.25 μm, He; Tstart: 60. C; Tend: 270. C |

References

Verkin, Sukodub, et al., 1976
Verkin, B.I.; Sukodub, L.F.; Yanson, I.K.,
Ionization potentials of nitrogenous bases of of nucleic acids,
Dokl. Akad. Nauk SSSR, 1976, 228, 1452. [all data]
Todua, 2011
Todua, N.G.,
Retention Data. NIST Mass Spectrometry Data Center., NIST Mass Spectrometry Data Center, 2011. [all data]