5H-Dibenzo[a,d]cyclohepten-5-one
- Formula: C15H10O
- Molecular weight: 206.2393
- IUPAC Standard InChIKey: SNVTZAIYUGUKNI-UHFFFAOYSA-N
- CAS Registry Number: 2222-33-5
- Chemical structure:
View 3d structure (requires JavaScript / HTML 5) - Other names: 2,3:6,7-Dibenzosuberen-4-on-1; 2,3:6,7-Dibenzotropone; 5H-Dibenzo[a,d]cycloheptenone; Dibenzosuberenone; Dibenzosuberenone-5; 5-Dibenzosuberenone; Dibenzo(a,d)cyclohepten-5-one; NSC 86151; dibenzo[b,f]cyclohepten-1-one

Condensed phase thermochemistry data

Data compiled by: Hussein Y. Afeefy, Joel F. Liebman, and Stephen E. Stein
Quantity | Value | Units | Method | Reference | Comment |
---|---|---|---|---|---|
ΔfH°solid | -7. ± 27. | kJ/mol | Ccb | Perisanu, Banciu, et al., 1993 | |
Quantity | Value | Units | Method | Reference | Comment |
ΔcH°solid | -7326. ± 27. | kJ/mol | Ccb | Perisanu, Banciu, et al., 1993 | Corresponding ΔfHºsolid = -5.62 kJ/mol (simple calculation by NIST; no Washburn corrections) |

Gas phase ion energetics data

Data compiled by: Sharon G. Lias, Rhoda D. Levin, and Sherif A. Kafafi
Ionization energy determinations
IE (eV) | Method | Reference | Comment |
---|---|---|---|
8.06 ± 0.03 | PE | Allan, Heilbronner, et al., 1975 | Vertical value |

References

Perisanu, Banciu, et al., 1993
Perisanu, S.; Banciu, A.; Banciu, M.,
The standard enthalpies of formation of some dibenzocycloheptane ketones,
Thermochim. Acta, 1993, 228, 393-396. [all data]
Allan, Heilbronner, et al., 1975
Allan, M.; Heilbronner, E.; Kloster-Jensen, E.,
A photoelectron-spectroscopic investigation of benzologue tropones,
J. Electron Spectrosc. Relat. Phenom., 1975, 6, 181. [all data]