Bicyclo[2.2.2]oct-5-en-2-one
- Formula: C8H10O
- Molecular weight: 122.1644
- IUPAC Standard InChIKey: UJVGEBBKXJLFPB-UHFFFAOYSA-N
- CAS Registry Number: 2220-40-8
- Chemical structure:
View 3d structure (requires JavaScript / HTML 5) - Other names: Bicyclo[2.2.2]octenone; Bicyclo[2.2.2]oct-5-ene-2-one

Gas phase ion energetics data

Data compiled by: Sharon G. Lias, Rhoda D. Levin, and Sherif A. Kafafi
Ionization energy determinations
IE (eV) | Method | Reference | Comment |
---|---|---|---|
8.6 | PE | Carnovale, Gan, et al., 1981 | |
8.96 ± 0.05 | PE | Carnovale, Gan, et al., 1981 | Vertical value |
8.73 | PE | Hentrich, Gunkel, et al., 1974 | Vertical value |

References

Carnovale, Gan, et al., 1981
Carnovale, F.; Gan, R.-H.; Peel, J.B.; Holmes, A.B.,
Photoelectron spectroscopic studies of some 2-azabicyclo[2.2.2]octan-5-one and Bicyclo[2.2.2]octanone derivatives,
J. Chem. Soc. Perkin Trans. 2, 1981, 7, 991. [all data]
Hentrich, Gunkel, et al., 1974
Hentrich, G.; Gunkel, E.; Klessinger, M.,
Photoelektronenspektren organischer verbindungen. 4. Photoelektronenspektren ungesattigter carbonylverbindungen,
J. Mol. Struct., 1974, 21, 231. [all data]