N,N-Di-(n-propyl)benzenamine
- Formula: C12H19N
- Molecular weight: 177.2860
- IUPAC Standard InChIKey: MMFBQHXDINNBMW-UHFFFAOYSA-N
- CAS Registry Number: 2217-07-4
- Chemical structure:
View 3d structure (requires JavaScript / HTML 5) - Other names: N,N-di-n-Propylaniline; Benzenamine, N,N-dipropyl-; Aniline, N,N-dipropyl-; Dipropylamine, N-phenyl-; Dipropylaniline; N,N-Dipropylaniline

Gas phase ion energetics data

Data evaluated as indicated in comments:
HL - Edward P. Hunter and Sharon G. Lias
Data compiled as indicated in comments:
LBLHLM - Sharon G. Lias, John E. Bartmess, Joel F. Liebman, John L. Holmes, Rhoda D. Levin, and W. Gary Mallard
RDSH - Henry M. Rosenstock, Keith Draxl, Bruce W. Steiner, and John T. Herron
Quantity | Value | Units | Method | Reference | Comment |
---|---|---|---|---|---|
Proton affinity (review) | 963.0 | kJ/mol | N/A | Hunter and Lias, 1998 | HL |
Quantity | Value | Units | Method | Reference | Comment |
Gas basicity | 931.1 | kJ/mol | N/A | Hunter and Lias, 1998 | HL |
Ionization energy determinations
IE (eV) | Method | Reference | Comment |
---|---|---|---|
6.93 | EQ | Lias, Jackson, et al., 1985 | LBLHLM |
6.96 | CTS | Farrell and Newton, 1965 | RDSH |
7.15 | CTS | Briegleb and Czekalla, 1959 | RDSH |

References

Hunter and Lias, 1998
Hunter, E.P.; Lias, S.G.,
Evaluated Gas Phase Basicities and Proton Affinities of Molecules: An Update,
J. Phys. Chem. Ref. Data, 1998, 27, 3, 413-656, https://doi.org/10.1063/1.556018
. [all data]
Lias, Jackson, et al., 1985
Lias, S.G.; Jackson, J.-A.A.; Argentar, H.; Liebman, J.F.,
Substituted N,N-dialkylanilines: Relative ionization energies and proton affinities through determinations of ion-molecule reaction equilibrium constants,
J. Org. Chem., 1985, 50, 333. [all data]
Farrell and Newton, 1965
Farrell, P.G.; Newton, J.,
Ionization potentials of aromatic amines,
J. Phys. Chem., 1965, 69, 3506. [all data]
Briegleb and Czekalla, 1959
Briegleb, G.; Czekalla, J.,
Die Bestimmung von lonisierungsenergien aus den Spektren von Elektronenubergangskomplexen,
Z.Elektrochem., 1959, 63, 6. [all data]