1-Piperidinamine
- Formula: C5H12N2
- Molecular weight: 100.1622
- IUPAC Standard InChIKey: LWMPFIOTEAXAGV-UHFFFAOYSA-N
- CAS Registry Number: 2213-43-6
- Chemical structure:
View 3d structure (requires JavaScript / HTML 5) - Other names: Piperidine, 1-amino-; N-Aminopiperidine; 1-Aminopiperidine; 1,1-Pentamethylenehydrazine; N-piperidylamine

Phase change data

Data compiled by: Robert L. Brown and Stephen E. Stein
Reduced pressure boiling point
Tboil (K) | Pressure (bar) | Reference |
---|---|---|
419.2 | 0.973 | Weast and Grasselli, 1989 |

Gas phase ion energetics data

Data compiled by: Sharon G. Lias, Rhoda D. Levin, and Sherif A. Kafafi
Ionization energy determinations
IE (eV) | Method | Reference | Comment |
---|---|---|---|
8.631 | PE | Nelsen and Buschek, 1974 | Vertical value |

Normal alkane RI, non-polar column, custom temperature program

Column type | Active phase | I | Reference | Comment |
---|---|---|---|---|
Capillary | Polydimethyl siloxanes | 859. | Zenkevich, 2001 | Program: not specified |

References

Weast and Grasselli, 1989
CRC Handbook of Data on Organic Compounds, 2nd Editon, Weast,R.C and Grasselli, J.G., ed(s)., CRC Press, Inc., Boca Raton, FL, 1989, 1. [all data]
Nelsen and Buschek, 1974
Nelsen, S.F.; Buschek, J.M.,
Photoelectron spectra of hydrazines. IV. Empirical estimation of lone pair-lone pair dihedral angles and prediction of lone pair ionization potentials for some cyclic and bicyclic hydrazines,
J. Am. Chem. Soc., 1974, 96, 6982. [all data]
Zenkevich, 2001
Zenkevich, I.G.,
Encyclopedia of Chromatography. Derivatization of Carbonyls for GC Analysis, MArcel Dekker, Inc., New York - Basel, 2001, 233. [all data]