Di-tert-butyl sulfoxide
- Formula: C8H18OS
- Molecular weight: 162.293
- IUPAC Standard InChIKey: HKKFQOPIRHHEGQ-UHFFFAOYSA-N
- CAS Registry Number: 2211-92-9
- Chemical structure:
View 3d structure (requires JavaScript / HTML 5) - Permanent link for this species. Use this link for bookmarking this species for future reference.

Phase change data

Data compiled by: Thermodynamics Research Center, NIST Boulder Laboratories, Chris Muzny director
Quantity | Value | Units | Method | Reference | Comment |
---|---|---|---|---|---|
Tfus | 336.4 | K | N/A | Dyer, Harris, et al., 1982 | Uncertainty assigned by TRC = 4. K |

Gas phase ion energetics data

Data compiled as indicated in comments:
LLK - Sharon G. Lias, Rhoda D. Levin, and Sherif A. Kafafi
Ionization energy determinations
IE (eV) | Method | Reference | Comment |
---|---|---|---|
8.0 | PE | Bock and Solouki, 1974 | LLK |
8.18 | PE | Bock and Solouki, 1974 | Vertical value; LLK |
8.18 | PE | Bock and Solouki, 1972 | Vertical value; LLK |

References

Dyer, Harris, et al., 1982
Dyer, J.C.; Harris, D.L.; Evans, S.A.,
Oxygen-17 Nulcear Magnetic RFesonacne SPtroscopy of Sulfoxides and Sulfones. Alkyl Substituent Induced Chemical Shifts,
J. Org. Chem., 1982, 47, 3660-4. [all data]
Bock and Solouki, 1974
Bock, H.; Solouki, B.,
Photoelektronenspektren und molekuleigenschaften, XXXV. Sulfoxide X2SO - beispiele fur den nutzen von korrelations - diagrammen bei der diskussion von substituenteneffekten und von geometrischen storungen,
Chem. Ber., 1974, 107, 2299. [all data]
Bock and Solouki, 1972
Bock, H.; Solouki, B.,
The sulfoxide bond,
Angew. Chem. Int. Ed. Engl., 1972, 11, 436. [all data]