2-acetoxypropanal
- Formula: C5H8O3
- Molecular weight: 116.1152
- IUPAC Standard InChIKey: FXPPNKAYSGWCQG-UHFFFAOYSA-N
- CAS Registry Number: 22094-23-1
- Chemical structure:
View 3d structure (requires JavaScript / HTML 5) - Other names: 1-formylethyl acetate; Propanal, 2-(acetyloxy)-

Phase change data

Data compiled by: Robert L. Brown and Stephen E. Stein
Reduced pressure boiling point
Tboil (K) | Pressure (bar) | Reference |
---|---|---|
325. to 328. | 0.020 | Buckingham and Donaghy, 1982 |

Normal alkane RI, polar column, temperature ramp

Column type | Active phase | I | Reference | Comment |
---|---|---|---|---|
Capillary | Carbowax 20M | 1355. | Kawakami and Kobayashi, 1991 | He, 60. C @ 4. min, 2. K/min; Column length: 50. m; Column diameter: 0.25 mm; Tend: 180. C |

References

Buckingham and Donaghy, 1982
Buckingham, J.; Donaghy, S.M.,
Dictionary of Organic Compounds: Fifth Edition, Chapman and Hall, New York, 1982, 1. [all data]
Kawakami and Kobayashi, 1991
Kawakami, M.; Kobayashi, A.,
Volatitle constituents of greem mate and roasted mate,
J. Agric. Food Chem., 1991, 39, 7, 1275-1279, https://doi.org/10.1021/jf00007a016
. [all data]