Cyclohexane, 1,4-dimethyl-, trans-
- Formula: C8H16
- Molecular weight: 112.2126
- IUPAC Standard InChIKey: QRMPKOFEUHIBNM-ZKCHVHJHSA-N
- CAS Registry Number: 2207-04-7
- Chemical structure:
View 3d structure (requires JavaScript / HTML 5) - Stereoisomers:
- Other names: trans-1,4-Dimethylcyclohexane; 1,trans-4-Dimethylcyclohexane; 1,4-Dimethylcyclohexane, trans-; Cyclohexane, trans-1,4-dimethyl-; t-1,4-Dimethylcyclohexane; 1,4(trans)-dimethylcyclohexane

Gas phase thermochemistry data

Data compiled by: Glushko Thermocenter, Russian Academy of Sciences, Moscow
Quantity | Value | Units | Method | Reference | Comment |
---|---|---|---|---|---|
S°gas | 365.89 | J/mol*K | N/A | Huffman H.M., 1949 |
Constant pressure heat capacity of gas
Cp,gas (J/mol*K) | Temperature (K) | Reference | Comment |
---|---|---|---|
39.89 | 50. | Thermodynamics Research Center, 1997 | p=1 bar. There is an appreciable difference, mainly at high temperatures, with values estimated earlier by a method of increments [ Beckett C.W., 1947]. |
65.60 | 100. | ||
85.96 | 150. | ||
105.2 | 200. | ||
140.6 | 273.15 | ||
154.4 | 298.15 | ||
155.4 | 300. | ||
211.9 | 400. | ||
262.8 | 500. | ||
305.5 | 600. | ||
341.0 | 700. | ||
371.0 | 800. | ||
396.4 | 900. | ||
418.1 | 1000. | ||
436.6 | 1100. | ||
452.5 | 1200. | ||
466.1 | 1300. | ||
477.8 | 1400. | ||
487.9 | 1500. | ||
507.5 | 1750. | ||
521.3 | 2000. | ||
531.4 | 2250. | ||
538.9 | 2500. | ||
544.6 | 2750. | ||
549.0 | 3000. |

Condensed phase thermochemistry data

Data compiled as indicated in comments:
ALS - Hussein Y. Afeefy, Joel F. Liebman, and Stephen E. Stein
DH - Eugene S. Domalski and Elizabeth D. Hearing
Quantity | Value | Units | Method | Reference | Comment |
---|---|---|---|---|---|
ΔcH°liquid | -5212.3 ± 1.7 | kJ/mol | Ccb | Johnson, Prosen, et al., 1947 | Corresponding ΔfHºliquid = -222.4 kJ/mol (simple calculation by NIST; no Washburn corrections); ALS |
Quantity | Value | Units | Method | Reference | Comment |
S°liquid | 268.03 | J/mol*K | N/A | Huffman, Todd, et al., 1949 | DH |
Constant pressure heat capacity of liquid
Cp,liquid (J/mol*K) | Temperature (K) | Reference | Comment |
---|---|---|---|
210.25 | 298.15 | Huffman, Todd, et al., 1949 | T = 12 to 310 K.; DH |

Phase change data

Data compiled as indicated in comments:
TRC - Thermodynamics Research Center, NIST Boulder Laboratories, Chris Muzny director
AC - William E. Acree, Jr., James S. Chickos
ALS - Hussein Y. Afeefy, Joel F. Liebman, and Stephen E. Stein
DH - Eugene S. Domalski and Elizabeth D. Hearing
Quantity | Value | Units | Method | Reference | Comment |
---|---|---|---|---|---|
Tboil | 392.6 ± 0.6 | K | AVG | N/A | Average of 19 out of 20 values; Individual data points |
Quantity | Value | Units | Method | Reference | Comment |
Tfus | 237. ± 4. | K | AVG | N/A | Average of 6 values; Individual data points |
Quantity | Value | Units | Method | Reference | Comment |
Ttriple | 236.22 | K | N/A | Huffman, Todd, et al., 1949, 2 | Uncertainty assigned by TRC = 0.02 K; TRC |
Quantity | Value | Units | Method | Reference | Comment |
Tc | 5877.7 ± 0.5 | K | N/A | Daubert, 1996 | |
Tc | 590. | K | N/A | Majer and Svoboda, 1985 | |
Tc | 587.7 | K | N/A | Powell, Swinton, et al., 1970 | Uncertainty assigned by TRC = 0.58 K; Visual in metal block oven, TE cal. by measurement of Tc of alkanes and benzene, hexafluorobenzene and cyclohexane. See R. J. Powell and F.J.Swinton, 1970 for purification.; TRC |
Quantity | Value | Units | Method | Reference | Comment |
ΔvapH° | 37.95 | kJ/mol | N/A | Majer and Svoboda, 1985 | |
ΔvapH° | 37.6 | kJ/mol | N/A | Kusano and Saito, 1975 | AC |
ΔvapH° | 37.9 | kJ/mol | N/A | Reid, 1972 | AC |
ΔvapH° | 39.9 ± 0.1 | kJ/mol | C | Osborne and Ginnings, 1947 | AC |
ΔvapH° | 37.87 | kJ/mol | C | Osborne and Ginnings, 1947, 2 | ALS |
Enthalpy of vaporization
ΔvapH (kJ/mol) | Temperature (K) | Method | Reference | Comment |
---|---|---|---|---|
32.56 | 392.5 | N/A | Majer and Svoboda, 1985 | |
36.7 | 328. | A,MM | Stephenson and Malanowski, 1987 | Based on data from 313. to 395. K. See also Willingham, Taylor, et al., 1945.; AC |
35.6 ± 0.1 | 341. | C | McCullough, Person, et al., 1951 | AC |
34.6 ± 0.1 | 357. | C | McCullough, Person, et al., 1951 | AC |
33.5 ± 0.1 | 377. | C | McCullough, Person, et al., 1951 | AC |
Enthalpy of vaporization
ΔvapH =
A exp(-βTr) (1 − Tr)β
ΔvapH =
Enthalpy of vaporization (at saturation pressure)
(kJ/mol)
Tr = reduced temperature (T / Tc)
View plot Requires a JavaScript / HTML 5 canvas capable browser.
Temperature (K) | A (kJ/mol) | β | Tc (K) | Reference | Comment |
---|---|---|---|---|---|
298. to 377. | 52.88 | 0.2755 | 590. | Majer and Svoboda, 1985 |
Enthalpy of fusion
ΔfusH (kJ/mol) | Temperature (K) | Reference | Comment |
---|---|---|---|
12.3311 | 236.22 | Huffman, Todd, et al., 1949 | DH |
12.34 | 236.2 | Domalski and Hearing, 1996 | AC |
Entropy of fusion
ΔfusS (J/mol*K) | Temperature (K) | Reference | Comment |
---|---|---|---|
52.21 | 236.22 | Huffman, Todd, et al., 1949 | DH |

Gas phase ion energetics data

Data compiled as indicated in comments:
LBLHLM - Sharon G. Lias, John E. Bartmess, Joel F. Liebman, John L. Holmes, Rhoda D. Levin, and W. Gary Mallard
LLK - Sharon G. Lias, Rhoda D. Levin, and Sherif A. Kafafi
Ionization energy determinations
IE (eV) | Method | Reference | Comment |
---|---|---|---|
9.56 | EQ | Sieck and Mautner(Meot-Ner), 1982 | LBLHLM |
9.92 ± 0.05 | EI | Herzschuh and Sicker, 1981 | LLK |
Appearance energy determinations
Ion | AE (eV) | Other Products | Method | Reference | Comment |
---|---|---|---|---|---|
C6H11+ | 11.27 ± 0.05 | C2H5 | EI | Herzschuh and Sicker, 1981 | LLK |
C7H13+ | 10.92 ± 0.05 | CH3 | EI | Herzschuh and Sicker, 1981 | LLK |

Reaction thermochemistry data

Data compiled by: Hussein Y. Afeefy, Joel F. Liebman, and Stephen E. Stein
Individual Reactions
By formula: C8H16 = C8H16
Quantity | Value | Units | Method | Reference | Comment |
---|---|---|---|---|---|
ΔrH° | 1.8 ± 0.1 | kcal/mol | Eqk | Mann, 1968 | gas phase; At 593K |

Kovats' RI, non-polar column, isothermal

Column type | Active phase | Temperature (C) | I | Reference | Comment |
---|---|---|---|---|---|
Packed | C78, Branched paraffin | 130. | 816.7 | Dallos, Sisak, et al., 2000 | He; Column length: 3.3 m |
Capillary | OV-101 | 0. | 765. | Skrbic, 1997 | |
Capillary | OV-101 | 150. | 802.6 | Cha and Lee, 1994 | Column length: 20. m; Column diameter: 0.5 mm |
Capillary | OV-101 | 180. | 808.0 | Cha and Lee, 1994 | Column length: 20. m; Column diameter: 0.5 mm |
Capillary | Squalane | 25. | 780. | Hilal, Carreira, et al., 1994 | |
Capillary | DB-1 | 60. | 780.2 | Krupcik, Skacani, et al., 1994 | H2; Phase thickness: 0.25 μm |
Capillary | PONA | 60. | 780.3 | Krupcik, Skacani, et al., 1994 | H2; Phase thickness: 0.5 μm |
Capillary | DB-1 | 60. | 780.5 | Krupcik, Skacani, et al., 1994 | H2; Phase thickness: 1. μm |
Capillary | OV-101 | 60. | 779.9 | Krupcik, Skacani, et al., 1994 | H2; Phase thickness: 0.2 μm |
Packed | C78, Branched paraffin | 130. | 816.0 | Reddy, Dutoit, et al., 1992 | Chromosorb G HP; Column length: 3.3 m |
Capillary | OV-101 | 40. | 774. | Laub and Purnell, 1988 | |
Capillary | OV-101 | 60. | 779. | Laub and Purnell, 1988 | |
Capillary | OV-101 | 80. | 784. | Laub and Purnell, 1988 | |
Packed | OV-101 | 120. | 788. | Litvinenko, Isakova, et al., 1988 | He, Chromaton W AW; Column length: 2.4 m |
Packed | Squalane | 50. | 784.9 | Litvinenko, Isakova, et al., 1988 | |
Capillary | Squalane | 50. | 786.2 | Lunskii and Paizanskaya, 1988 | He; Column length: 50. m; Column diameter: 0.22 mm |
Capillary | Squalane | 70. | 790.3 | Lunskii and Paizanskaya, 1988 | He; Column length: 50. m; Column diameter: 0.22 mm |
Capillary | OV-101 | 40. | 774.9 | Boneva and Dimov, 1986 | 100. m/0.27 mm/0.9 μm |
Capillary | OV-101 | 50. | 777.2 | Boneva and Dimov, 1986 | 100. m/0.27 mm/0.9 μm |
Capillary | OV-101 | 60. | 779.6 | Boneva and Dimov, 1986 | 100. m/0.27 mm/0.9 μm |
Capillary | OV-101 | 70. | 782.0 | Boneva and Dimov, 1986 | 100. m/0.27 mm/0.9 μm |
Capillary | Squalane | 50. | 785.6 | Krupcik, Cellar, et al., 1986 | Column length: 180. m; Column diameter: 0.25 mm |
Capillary | OV-101 | 30. | 772. | Chien, Furio, et al., 1983 | |
Capillary | OV-101 | 40. | 774. | Chien, Furio, et al., 1983 | |
Capillary | OV-101 | 50. | 776. | Chien, Furio, et al., 1983 | |
Capillary | OV-101 | 60. | 779. | Chien, Furio, et al., 1983 | |
Capillary | OV-101 | 70. | 781. | Chien, Furio, et al., 1983 | |
Capillary | OV-101 | 80. | 784. | Chien, Furio, et al., 1983 | |
Capillary | DB-1 | 60. | 780.2 | Lubeck and Sutton, 1983 | Column length: 60. m; Column diameter: 0.264 mm |
Capillary | DB-1 | 60. | 780.5 | Lubeck and Sutton, 1983 | 60. m/0.259 mm/1. μm |
Capillary | SE-30 | 80. | 785. | Bredael, 1982 | Column length: 100. m; Column diameter: 0.5 mm |
Capillary | OV-101 | 50. | 777. | Johansen and Ettre, 1982 | 100. m/0.27 mm/0.20 μm |
Capillary | OV-101 | 50. | 777. | Johansen and Ettre, 1982 | 55. m/0.27 mm/0.9 μm |
Capillary | SF-96 | 50. | 777. | Johansen and Ettre, 1982 | 91.4 m/0.31 mm/0.20 μm |
Capillary | SE-30 | 80. | 784.1 | Albaigés and Guardino, 1980 | He; Column length: 64. m; Column diameter: 0.25 mm |
Capillary | Squalane | 80. | 791.9 | Albaigés and Guardino, 1980 | He; Column length: 100. m; Column diameter: 0.25 mm |
Capillary | Squalane | 70. | 790.2 | Nabivach and Kirilenko, 1979 | N2; Column length: 50. m |
Capillary | Squalane | 100. | 790.8 | Lulova, Leont'eva, et al., 1976 | He; Column length: 120. m; Column diameter: 0.25 mm |
Capillary | Squalane | 100. | 800. | Mitra, Mohan, et al., 1974 | H2; Column length: 50. m; Column diameter: 0.2 mm |
Capillary | Vacuum Grease Oil (VM-4) | 35. | 783. | Sidorov, Petrova, et al., 1972 | |
Capillary | Vacuum Grease Oil (VM-4) | 45. | 786. | Sidorov, Petrova, et al., 1972 | |
Capillary | Vacuum Grease Oil (VM-4) | 50. | 788. | Sidorov, Petrova, et al., 1972 | |
Capillary | Vacuum Grease Oil (VM-4) | 58. | 791. | Sidorov, Petrova, et al., 1972 | |
Capillary | Vacuum Grease Oil (VM-4) | 68. | 794. | Sidorov, Petrova, et al., 1972 | |
Capillary | Squalane | 70. | 785. | Dimov and Schopov, 1971 | Column length: 100. m; Column diameter: 0.25 mm |
Packed | Vacuum Grease Oil (VM-4) | 35. | 783. | Sidorov, Ivanova, et al., 1971 | |
Packed | SE-30 | 130. | 796. | Mitra and Saha, 1970 | N2 |
Packed | SE-30 | 80. | 781. | Mitra and Saha, 1970 | N2 |
Capillary | Squalane | 70. | 789. | Schomburg, 1966 | |
Packed | Methyl Silicone | 130. | 796. | Antheaume and Guiochon, 1965 |

Kovats' RI, non-polar column, temperature ramp

Column type | Active phase | I | Reference | Comment |
---|---|---|---|---|
Capillary | OV-101 | 772. | Hayes and Pitzer, 1982 | 110. m/0.25 mm/0.20 μm, He, 1. K/min; Tstart: 35. C; Tend: 200. C |
Capillary | Apiezon L | 800. | Louis, 1971 | N2, 1. K/min; Column length: 50. m; Column diameter: 0.25 mm; Tstart: 60. C |

Kovats' RI, non-polar column, custom temperature program

Column type | Active phase | I | Reference | Comment |
---|---|---|---|---|
Capillary | Petrocol DH-100 | 774.5 | Haagen-Smit Laboratory, 1997 | He; Column length: 100. m; Column diameter: 0.2 mm; Program: 5C(10min) => 5C/min => 50C(48min) => 1.5C/min => 195C(91min) |

Van Den Dool and Kratz RI, non-polar column, temperature ramp

Column type | Active phase | I | Reference | Comment |
---|---|---|---|---|
Capillary | Petrocol DH | 778.5 | Censullo, Jones, et al., 2003 | 50. m/0.25 mm/0.5 μm, He, 35. C @ 10. min, 3. K/min, 200. C @ 10. min |
Capillary | SPB-1 | 772.09 | LECO Corporation, 2003 | 30. m/0.25 mm/0.25 μm, 40. C @ 2. min, 10. K/min, 250. C @ 2. min |
Capillary | SPB-1 | 770.39 | LECO Corporation, 2003 | 30. m/0.25 mm/0.25 μm, 40. C @ 2. min, 10. K/min, 250. C @ 2. min |
Capillary | DB-5 | 775.6 | Song, Lai, et al., 2003 | 30. m/0.25 mm/0.25 μm, He, 2. K/min; Tstart: 40. C; Tend: 310. C |
Capillary | DB-5 | 776.7 | Song, Lai, et al., 2003 | 30. m/0.25 mm/0.25 μm, He, 4. K/min; Tstart: 40. C; Tend: 310. C |
Capillary | DB-5 | 777.3 | Song, Lai, et al., 2003 | 30. m/0.25 mm/0.25 μm, He, 6. K/min; Tstart: 40. C; Tend: 310. C |
Capillary | DB-5 | 785.4 | Xu, van Stee, et al., 2003 | 30. m/0.25 mm/1. μm, He, 2.5 K/min; Tstart: 50. C; Tend: 200. C |
Capillary | OV-101 | 776.7 | Yin, Liu, et al., 2001 | N2, 1. K/min; Column length: 80. m; Column diameter: 0.22 mm; Tstart: 30. C; Tend: 130. C |
Capillary | DB-5 | 775.6 | Lai and Song, 1995 | 30. m/0.25 mm/0.25 μm, He, 2. K/min; Tstart: 40. C; Tend: 310. C |
Capillary | DB-5 | 776.7 | Lai and Song, 1995 | 30. m/0.25 mm/0.25 μm, He, 4. K/min; Tstart: 40. C; Tend: 310. C |
Capillary | DB-5 | 777.3 | Lai and Song, 1995 | 30. m/0.25 mm/0.25 μm, He, 6. K/min; Tstart: 40. C; Tend: 310. C |
Capillary | Petrocol DH | 774. | White, Hackett, et al., 1992 | 100. m/0.25 mm/0.5 μm, He, 1. K/min; Tstart: 30. C; Tend: 220. C |
Capillary | OV-101 | 772. | Hayes and Pitzer, 1981 | 108. m/0.25 mm/0.2 μm, 1. K/min; Tstart: 35. C; Tend: 200. C |

Normal alkane RI, non-polar column, isothermal

Column type | Active phase | Temperature (C) | I | Reference | Comment |
---|---|---|---|---|---|
Capillary | Squalane | 86. | 790. | Vigdergauz and Martynov, 1971 | He; Column length: 150. m; Column diameter: 0.35 mm |

Normal alkane RI, non-polar column, temperature ramp

Column type | Active phase | I | Reference | Comment |
---|---|---|---|---|
Capillary | Polydimethyl siloxane: CP-Sil 5 CB | 779. | Bramston-Cook, 2013 | 60. m/0.25 mm/1.0 μm, Helium, 45. C @ 1.45 min, 3.6 K/min, 210. C @ 2.72 min |
Capillary | Petrocol DH | 774. | Supelco, 2012 | 100. m/0.25 mm/0.50 μm, Helium, 20. C @ 15. min, 15. K/min, 220. C @ 30. min |
Capillary | PONA | 779. | Zhang, Ding, et al., 2009 | 50. m/0.20 mm/0.50 μm, Nitrogen, 35. C @ 15. min, 2. K/min, 200. C @ 10. min |
Capillary | HP-5 MS | 774. | Zhao, Zeng, et al., 2009 | 30. m/0.25 mm/0.25 μm, Helium, 4. K/min; Tstart: 50. C; Tend: 280. C |
Capillary | OV-101 | 773. | Orav, Kailas, et al., 1999 | 50. m/0.20 mm/0.50 μm, Helium, 30. C @ 6. min, 1. K/min; Tend: 100. C |
Capillary | Squalane | 784.6 | Krupcik, Cellar, et al., 1986 | 0.1 K/min; Column length: 100. m; Column diameter: 0.25 mm |
Capillary | Squalane | 786.1 | Krupcik, Cellar, et al., 1986 | 0.2 K/min; Column length: 100. m; Column diameter: 0.25 mm |
Capillary | Squalane | 788.4 | Krupcik, Cellar, et al., 1986 | 0.4 K/min; Column length: 100. m; Column diameter: 0.25 mm |
Capillary | Squalane | 790.2 | Krupcik, Cellar, et al., 1986 | 0.6 K/min; Column length: 100. m; Column diameter: 0.25 mm |
Capillary | Squalane | 791.7 | Krupcik, Cellar, et al., 1986 | 0.8 K/min; Column length: 100. m; Column diameter: 0.25 mm |
Capillary | Squalane | 793.1 | Krupcik, Cellar, et al., 1986 | 1. K/min; Column length: 100. m; Column diameter: 0.25 mm |
Packed | Apiezon L | 736. | Dahlmann, Köser, et al., 1979 | Chromosorb G-AW-DMCS, 10. K/min; Column length: 2. m; Tstart: 25. C |

Normal alkane RI, non-polar column, custom temperature program

Column type | Active phase | I | Reference | Comment |
---|---|---|---|---|
Capillary | Methyl Silicone | 774. | Spieksma, 1999 | Program: not specified |
Capillary | OV-101 | 765. | Skrbic and Cvejanov, 1993 | Program: not specified |
Capillary | OV-1, SE-30, Methyl silicone, SP-2100, OV-101, DB-1, etc. | 772. | Waggott and Davies, 1984 | Hydrogen; Column length: 50. m; Column diameter: 0.32 mm; Program: not specified |
Capillary | OV-1, SE-30, Methyl silicone, SP-2100, OV-101, DB-1, etc. | 778. | Waggott and Davies, 1984 | Hydrogen; Column length: 50. m; Column diameter: 0.32 mm; Program: not specified |
Capillary | OV-1, SE-30, Methyl silicone, SP-2100, OV-101, DB-1, etc. | 785. | Waggott and Davies, 1984 | Hydrogen; Column length: 50. m; Column diameter: 0.32 mm; Program: not specified |

Henry's Law data

Data compiled by: Rolf Sander

Henry's Law constant (water solution)

kH(T) = H exp(d(ln(kH))/d(1/T) ((1/T) - 1/(298.15 K)))
H = Henry's law constant for solubility in water at 298.15 K (mol/(kg*bar))
d(ln(kH))/d(1/T) = Temperature dependence constant (K)

H (mol/(kg*bar)) d(ln(kH))/d(1/T) (K) Method Reference Comment
0.0011 QN/A missing citation give several references for the Henry's law constants but don't assign them to specific species.
0.0011 LN/A

References

Huffman H.M., 1949
Huffman H.M.,
Low-temperature thermal data on eight C8H16 alkylcyclohexanes,
J. Am. Chem. Soc., 1949, 71, 584-592. [all data]
Thermodynamics Research Center, 1997
Thermodynamics Research Center,
Selected Values of Properties of Chemical Compounds., Thermodynamics Research Center, Texas A&M University, College Station, Texas, 1997. [all data]
Beckett C.W., 1947
Beckett C.W.,
The thermodynamic properties and molecular structure of cyclohexane, methylcyclohexane, ethylcyclohexane, and seven dimethylcyclohexanes,
J. Am. Chem. Soc., 1947, 69, 2488-2495. [all data]
Johnson, Prosen, et al., 1947
Johnson, W.H.; Prosen, E.J.; Rossini, F.D.,
Heats of combustion and isomerization of the eight C8H16 alkylcyclohexanes,
J. Res. NBS, 1947, 39, 49-52. [all data]
Huffman, Todd, et al., 1949
Huffman, H.M.; Todd, S.S.; Oliver, G.D.,
Low temperature thermal data on eight C8H16 alkylcyclohexanes,
J. Am. Chem. Soc., 1949, 71, 584-592. [all data]
Huffman, Todd, et al., 1949, 2
Huffman, H.M.; Todd, S.S.; Oliver, G.D.,
Low Temperature Thermal Data on Eight C8H16 Alkylcyclohexanes,
J. Am. Chem. Soc., 1949, 71, 584. [all data]
Daubert, 1996
Daubert, T.E.,
Vapor-Liquid Critical Properties of Elements and Compounds. 5. Branched Alkanes and Cycloalkanes,
J. Chem. Eng. Data, 1996, 41, 365-372. [all data]
Majer and Svoboda, 1985
Majer, V.; Svoboda, V.,
Enthalpies of Vaporization of Organic Compounds: A Critical Review and Data Compilation, Blackwell Scientific Publications, Oxford, 1985, 300. [all data]
Powell, Swinton, et al., 1970
Powell, R.J.; Swinton, F.L.; Young, C.L.,
The thermodynamic properties of fluorocarbon-hycrocarbon mixtures 3. Gas- Liquid critical temperatures and a comparison with the theory of Rowlinson and Sutton,
J. Chem. Thermodyn., 1970, 2, 105. [all data]
Kusano and Saito, 1975
Kusano, K.; Saito, Y.,
, Preprints 33rd Ann. Meeting Chem. Soc. Japan, Japan, 1975, 123. [all data]
Reid, 1972
Reid, Robert C.,
Handbook on vapor pressure and heats of vaporization of hydrocarbons and related compounds, R. C. Wilhort and B. J. Zwolinski, Texas A Research Foundation. College Station, Texas(1971). 329 pages.$10.00,
AIChE J., 1972, 18, 6, 1278-1278, https://doi.org/10.1002/aic.690180637
. [all data]
Osborne and Ginnings, 1947
Osborne, Nathan S.; Ginnings, Defoe C.,
Measurements of heat of vaporization and heat capacity of a number of hydrocarbons,
J. RES. NATL. BUR. STAN., 1947, 39, 5, 453-17, https://doi.org/10.6028/jres.039.031
. [all data]
Osborne and Ginnings, 1947, 2
Osborne, N.S.; Ginnings, D.C.,
Measurements of heat of vaporization and heat capacity of a number of hydrocarbons,
J. Res. NBS, 1947, 39, 453-477. [all data]
Stephenson and Malanowski, 1987
Stephenson, Richard M.; Malanowski, Stanislaw,
Handbook of the Thermodynamics of Organic Compounds, 1987, https://doi.org/10.1007/978-94-009-3173-2
. [all data]
Willingham, Taylor, et al., 1945
Willingham, C.B.; Taylor, W.J.; Pignocco, J.M.; Rossini, F.D.,
Vapor pressures and boiling points of some paraffin, alkylcyclopentane, alkylcyclohexane, and alkylbenzene hydrocarbons,
J. RES. NATL. BUR. STAN., 1945, 35, 3, 219-17, https://doi.org/10.6028/jres.035.009
. [all data]
McCullough, Person, et al., 1951
McCullough, J.P.; Person, W.B.; Spitzer, Ralph,
The Heats of Vaporization and Vapor Heat Capacities of Some Dimethylcyclohexanes 1,
J. Am. Chem. Soc., 1951, 73, 9, 4069-4071, https://doi.org/10.1021/ja01153a003
. [all data]
Domalski and Hearing, 1996
Domalski, Eugene S.; Hearing, Elizabeth D.,
Heat Capacities and Entropies of Organic Compounds in the Condensed Phase. Volume III,
J. Phys. Chem. Ref. Data, 1996, 25, 1, 1, https://doi.org/10.1063/1.555985
. [all data]
Sieck and Mautner(Meot-Ner), 1982
Sieck, L.W.; Mautner(Meot-Ner), M.,
Ionization energies and entropies of cycloalkanes. Kinetics of free energy controlled charge-transfer reactions,
J. Phys. Chem., 1982, 86, 3646. [all data]
Herzschuh and Sicker, 1981
Herzschuh, R.; Sicker, A.,
Stereochemische einflusse auf die ionisations- und auftrittsenergien cis/trans-isomerer dimethylcycloalkane,
Z. Chem., 1981, 21, 409. [all data]