Cyclohexane, 1,3-dimethyl-, trans-
- Formula: C8H16
- Molecular weight: 112.2126
- IUPAC Standard InChIKey: SGVUHPSBDNVHKL-YUMQZZPRSA-N
- CAS Registry Number: 2207-03-6
- Chemical structure:
View 3d structure (requires JavaScript / HTML 5) - Species with the same structure:
- Stereoisomers:
- Other names: trans-1,3-Dimethylcyclohexane; 1,trans-3-Dimethylcyclohexane; 1,3-Dimethylcyclohexane, trans; 1,3-Dimethyl(trans)-cyclohexane; Cyclohexane, trans-1,3-dimethyl-; 1,3(trans)-dimethylcyclohexane

Gas phase thermochemistry data

Data compiled by: Glushko Thermocenter, Russian Academy of Sciences, Moscow
Quantity | Value | Units | Method | Reference | Comment |
---|---|---|---|---|---|
S°gas | 376.39 | J/mol*K | N/A | Huffman H.M., 1949 |
Constant pressure heat capacity of gas
Cp,gas (J/mol*K) | Temperature (K) | Reference | Comment |
---|---|---|---|
39.47 | 50. | Thermodynamics Research Center, 1997 | p=1 bar. There is an appreciable difference, mainly at high temperatures, with values estimated earlier by a method of increments [ Beckett C.W., 1947]. |
64.59 | 100. | ||
85.04 | 150. | ||
104.3 | 200. | ||
139.6 | 273.15 | ||
153.4 | 298.15 | ||
154.4 | 300. | ||
211.0 | 400. | ||
262.3 | 500. | ||
305.5 | 600. | ||
341.6 | 700. | ||
371.9 | 800. | ||
397.5 | 900. | ||
419.2 | 1000. | ||
437.6 | 1100. | ||
453.3 | 1200. | ||
466.7 | 1300. | ||
478.1 | 1400. | ||
488.0 | 1500. | ||
507.2 | 1750. | ||
520.8 | 2000. | ||
530.7 | 2250. | ||
538.2 | 2500. | ||
543.9 | 2750. | ||
548.3 | 3000. |

Condensed phase thermochemistry data

Data compiled as indicated in comments:
ALS - Hussein Y. Afeefy, Joel F. Liebman, and Stephen E. Stein
DH - Eugene S. Domalski and Elizabeth D. Hearing
Quantity | Value | Units | Method | Reference | Comment |
---|---|---|---|---|---|
ΔcH°liquid | -5219.0 ± 1.7 | kJ/mol | Ccb | Johnson, Prosen, et al., 1947 | Corresponding ΔfHºliquid = -215.7 kJ/mol (simple calculation by NIST; no Washburn corrections); ALS |
Quantity | Value | Units | Method | Reference | Comment |
S°liquid | 276.27 | J/mol*K | N/A | Huffman, Todd, et al., 1949 | DH |
Constant pressure heat capacity of liquid
Cp,liquid (J/mol*K) | Temperature (K) | Reference | Comment |
---|---|---|---|
212.84 | 298.15 | Huffman, Todd, et al., 1949 | T = 12 to 310 K.; DH |

Phase change data

Data compiled as indicated in comments:
TRC - Thermodynamics Research Center, NIST Boulder Laboratories, Chris Muzny director
AC - William E. Acree, Jr., James S. Chickos
ALS - Hussein Y. Afeefy, Joel F. Liebman, and Stephen E. Stein
DH - Eugene S. Domalski and Elizabeth D. Hearing
Quantity | Value | Units | Method | Reference | Comment |
---|---|---|---|---|---|
Tboil | 396. ± 4. | K | AVG | N/A | Average of 9 values; Individual data points |
Quantity | Value | Units | Method | Reference | Comment |
Tfus | 406.83 | K | N/A | Streiff, Murphy, et al., 1947 | Uncertainty assigned by TRC = 0.06 K; TRC |
Tfus | 179.76 | K | N/A | Forziati, Glasgow, et al., 1946 | Uncertainty assigned by TRC = 0.02 K; called 1,cis-3-cimethylcyclohexane in the article; TRC |
Tfus | 196.45 | K | N/A | Anonymous, 1941 | Uncertainty assigned by TRC = 0.5 K; TRC |
Quantity | Value | Units | Method | Reference | Comment |
Ttriple | 183.06 | K | N/A | Huffman, Todd, et al., 1949, 2 | Uncertainty assigned by TRC = 0.02 K; TRC |
Ttriple | 183.030 | K | N/A | Huffman, 1948 | Uncertainty assigned by TRC = 0.05 K; TRC |
Ttriple | 183.060 | K | N/A | Huffman, 1948 | Uncertainty assigned by TRC = 0.02 K; TRC |
Quantity | Value | Units | Method | Reference | Comment |
ΔvapH° | 39.21 | kJ/mol | N/A | Majer and Svoboda, 1985 | |
ΔvapH° | 39.1 | kJ/mol | N/A | Kusano and Saito, 1975 | AC |
ΔvapH° | 39.2 | kJ/mol | N/A | Reid, 1972 | AC |
ΔvapH° | 39.2 ± 0.1 | kJ/mol | C | Osborne and Ginnings, 1947 | AC |
ΔvapH° | 39.19 | kJ/mol | C | Osborne and Ginnings, 1947, 2 | ALS |
Enthalpy of vaporization
ΔvapH (kJ/mol) | Temperature (K) | Method | Reference | Comment |
---|---|---|---|---|
33.39 | 397.6 | N/A | Majer and Svoboda, 1985 | |
37.9 | 329. | A | Stephenson and Malanowski, 1987 | Based on data from 314. to 400. K.; AC |
37.4 | 329. | MM | Willingham, Taylor, et al., 1945 | Based on data from 314. to 394. K.; AC |
Enthalpy of fusion
ΔfusH (kJ/mol) | Temperature (K) | Reference | Comment |
---|---|---|---|
9.8659 | 183.06 | Huffman, Todd, et al., 1949 | DH |
9.87 | 183.1 | Domalski and Hearing, 1996 | AC |
Entropy of fusion
ΔfusS (J/mol*K) | Temperature (K) | Reference | Comment |
---|---|---|---|
53.89 | 183.06 | Huffman, Todd, et al., 1949 | DH |

Reaction thermochemistry data

Data compiled by: Hussein Y. Afeefy, Joel F. Liebman, and Stephen E. Stein
Individual Reactions
By formula: C8H16 = C8H16
Quantity | Value | Units | Method | Reference | Comment |
---|---|---|---|---|---|
ΔrH° | -7.9 ± 0.4 | kJ/mol | Eqk | Mann, 1968 | gas phase; At 593K |

Gas phase ion energetics data

Data evaluated as indicated in comments:
L - Sharon G. Lias
Data compiled as indicated in comments:
LL - Sharon G. Lias and Joel F. Liebman
LBLHLM - Sharon G. Lias, John E. Bartmess, Joel F. Liebman, John L. Holmes, Rhoda D. Levin, and W. Gary Mallard
LLK - Sharon G. Lias, Rhoda D. Levin, and Sherif A. Kafafi
Quantity | Value | Units | Method | Reference | Comment |
---|---|---|---|---|---|
IE (evaluated) | 9.53 | eV | N/A | N/A | L |
Ionization energy determinations
IE (eV) | Method | Reference | Comment |
---|---|---|---|
9.52 ± 0.05 | EI | Holmes and Lossing, 1991 | LL |
9.53 | EQ | Sieck and Mautner(Meot-Ner), 1982 | LBLHLM |
9.89 ± 0.05 | EI | Herzschuh and Sicker, 1981 | LLK |
Appearance energy determinations
Ion | AE (eV) | Other Products | Method | Reference | Comment |
---|---|---|---|---|---|
C6H11+ | 11.05 ± 0.05 | C2H5 | EI | Herzschuh and Sicker, 1981 | LLK |
C7H13+ | 10.82 ± 0.05 | CH3 | EI | Herzschuh and Sicker, 1981 | LLK |

Kovats' RI, non-polar column, isothermal

Column type | Active phase | Temperature (C) | I | Reference | Comment |
---|---|---|---|---|---|
Capillary | OV-101 | 150. | 802.6 | Cha and Lee, 1994 | Column length: 20. m; Column diameter: 0.5 mm |
Capillary | OV-101 | 180. | 810.8 | Cha and Lee, 1994 | Column length: 20. m; Column diameter: 0.5 mm |
Capillary | DB-1 | 60. | 803.9 | Krupcik, Skacani, et al., 1994 | H2; Phase thickness: 0.25 μm |
Capillary | PONA | 60. | 804.1 | Krupcik, Skacani, et al., 1994 | H2; Phase thickness: 0.5 μm |
Capillary | PONA | 60. | 804.2 | Krupcik, Skacani, et al., 1994 | H2; Phase thickness: 0.5 μm |
Capillary | DB-1 | 60. | 804.3 | Krupcik, Skacani, et al., 1994 | H2; Phase thickness: 1. μm |
Capillary | OV-101 | 60. | 804.1 | Krupcik, Skacani, et al., 1994 | H2; Phase thickness: 0.2 μm |
Capillary | Squalane | 50. | 805.6 | Guan, Kiraly, et al., 1989 | 50. m/0.22 mm/0.21 μm, He |
Capillary | Squalane | 70. | 810.8 | Guan, Kiraly, et al., 1989 | 50. m/0.22 mm/0.21 μm, He |
Packed | OV-101 | 120. | 813. | Litvinenko, Isakova, et al., 1988 | He, Chromaton W AW; Column length: 2.4 m |
Packed | Squalane | 50. | 804.9 | Litvinenko, Isakova, et al., 1988 | |
Capillary | Squalane | 50. | 804.6 | Lunskii and Paizanskaya, 1988 | He; Column length: 50. m; Column diameter: 0.22 mm |
Capillary | Squalane | 70. | 809.8 | Lunskii and Paizanskaya, 1988 | He; Column length: 50. m; Column diameter: 0.22 mm |
Capillary | Squalane | 50. | 805.4 | Krupcik, Cellar, et al., 1986 | Column length: 180. m; Column diameter: 0.25 mm |
Capillary | DB-1 | 60. | 803.9 | Lubeck and Sutton, 1983 | Column length: 60. m; Column diameter: 0.264 mm |
Capillary | DB-1 | 60. | 804.3 | Lubeck and Sutton, 1983 | 60. m/0.259 mm/1. μm |
Capillary | SE-30 | 80. | 783. | Bredael, 1982 | Column length: 100. m; Column diameter: 0.5 mm |
Capillary | Squalane | 50. | 805.3 | Bajus, Veselý, et al., 1979 | Column length: 100. m; Column diameter: 0.25 mm |
Capillary | Squalane | 70. | 810.5 | Bajus, Veselý, et al., 1979 | Column length: 100. m; Column diameter: 0.25 mm |
Capillary | Squalane | 100. | 813.1 | Lulova, Leont'eva, et al., 1976 | He; Column length: 120. m; Column diameter: 0.25 mm |
Capillary | Squalane | 100. | 813.1 | Lulova, Leont'eva, et al., 1976 | He; Column length: 120. m; Column diameter: 0.25 mm |
Capillary | SE-30 | 130. | 822. | Mitra, Mohan, et al., 1974 | H2; Column length: 6.1 m; Column diameter: 3.18 mm |
Capillary | SE-30 | 150. | 829. | Mitra, Mohan, et al., 1974 | H2; Column length: 6.1 m; Column diameter: 3.18 mm |
Capillary | SE-30 | 160. | 833. | Mitra, Mohan, et al., 1974 | H2; Column length: 6.1 m; Column diameter: 3.18 mm |
Capillary | SE-30 | 170. | 836. | Mitra, Mohan, et al., 1974 | H2; Column length: 6.1 m; Column diameter: 3.18 mm |
Capillary | Squalane | 50. | 806. | Rijks and Cramers, 1974 | N2; Column length: 100. m; Column diameter: 0.25 mm |
Capillary | Squalane | 70. | 811. | Rijks and Cramers, 1974 | N2; Column length: 100. m; Column diameter: 0.25 mm |
Capillary | Vacuum Grease Oil (VM-4) | 35. | 802. | Sidorov, Petrova, et al., 1972 | |
Capillary | Vacuum Grease Oil (VM-4) | 45. | 807. | Sidorov, Petrova, et al., 1972 | |
Capillary | Vacuum Grease Oil (VM-4) | 50. | 808. | Sidorov, Petrova, et al., 1972 | |
Capillary | Vacuum Grease Oil (VM-4) | 58. | 811. | Sidorov, Petrova, et al., 1972 | |
Capillary | Vacuum Grease Oil (VM-4) | 68. | 814. | Sidorov, Petrova, et al., 1972 | |
Capillary | Squalane | 70. | 805.5 | Dimov and Schopov, 1971 | Column length: 100. m; Column diameter: 0.25 mm |
Packed | Vacuum Grease Oil (VM-4) | 35. | 802. | Sidorov, Ivanova, et al., 1971 | |
Packed | SE-30 | 130. | 823. | Mitra and Saha, 1970 | N2 |
Packed | SE-30 | 80. | 806. | Mitra and Saha, 1970 | N2 |
Capillary | Squalane | 70. | 810. | Schomburg, 1966 | |
Packed | Methyl Silicone | 130. | 798. | Antheaume and Guiochon, 1965 |

Kovats' RI, non-polar column, temperature ramp

Column type | Active phase | I | Reference | Comment |
---|---|---|---|---|
Capillary | DB-5 | 808.84 | Wang, Fingas, et al., 1994 | 30. m/0.32 mm/0.25 μm, He, 50. C @ 2. min, 6. K/min; Tend: 300. C |
Capillary | Apiezon L | 823. | Louis, 1971 | N2, 1. K/min; Column length: 50. m; Column diameter: 0.25 mm; Tstart: 60. C |

Kovats' RI, non-polar column, custom temperature program

Column type | Active phase | I | Reference | Comment |
---|---|---|---|---|
Capillary | Petrocol DH-100 | 798.7 | Haagen-Smit Laboratory, 1997 | He; Column length: 100. m; Column diameter: 0.2 mm; Program: 5C(10min) => 5C/min => 50C(48min) => 1.5C/min => 195C(91min) |
Capillary | DB-1 | 798. | Hoekman, 1993 | 60. m/0.32 mm/1.0 μm, He; Program: -40 C for 12 min; -40 - 125 C at 3 deg.min; 125-185 C at 6 deg/min; 185 - 220 C at 20 deg/min; hold 220 C for 2 min |

Van Den Dool and Kratz RI, non-polar column, temperature ramp

Column type | Active phase | I | Reference | Comment |
---|---|---|---|---|
Capillary | Petrocol DH | 802.8 | Censullo, Jones, et al., 2003 | 50. m/0.25 mm/0.5 μm, He, 35. C @ 10. min, 3. K/min, 200. C @ 10. min |
Capillary | DB-5 | 804.1 | Song, Lai, et al., 2003 | 30. m/0.25 mm/0.25 μm, He, 2. K/min; Tstart: 40. C; Tend: 310. C |
Capillary | DB-5 | 805.3 | Song, Lai, et al., 2003 | 30. m/0.25 mm/0.25 μm, He, 4. K/min; Tstart: 40. C; Tend: 310. C |
Capillary | DB-5 | 806.2 | Song, Lai, et al., 2003 | 30. m/0.25 mm/0.25 μm, He, 6. K/min; Tstart: 40. C; Tend: 310. C |
Capillary | OV-101 | 802.2 | Yin, Liu, et al., 2001 | N2, 1. K/min; Column length: 80. m; Column diameter: 0.22 mm; Tstart: 30. C; Tend: 130. C |
Capillary | DB-5 | 804.1 | Lai and Song, 1995 | 30. m/0.25 mm/0.25 μm, He, 2. K/min; Tstart: 40. C; Tend: 310. C |
Capillary | DB-5 | 805.3 | Lai and Song, 1995 | 30. m/0.25 mm/0.25 μm, He, 4. K/min; Tstart: 40. C; Tend: 310. C |
Capillary | DB-5 | 806.2 | Lai and Song, 1995 | 30. m/0.25 mm/0.25 μm, He, 6. K/min; Tstart: 40. C; Tend: 310. C |

Normal alkane RI, non-polar column, isothermal

Column type | Active phase | Temperature (C) | I | Reference | Comment |
---|---|---|---|---|---|
Capillary | OV-101 | 50. | 800. | Wu and Lu, 1984 | |
Capillary | OV-101 | 70. | 806. | Wu and Lu, 1984 |

Normal alkane RI, non-polar column, temperature ramp

Column type | Active phase | I | Reference | Comment |
---|---|---|---|---|
Capillary | Polydimethyl siloxane: CP-Sil 5 CB | 806. | Bramston-Cook, 2013 | 60. m/0.25 mm/1.0 μm, Helium, 45. C @ 1.45 min, 3.6 K/min, 210. C @ 2.72 min |
Capillary | Squalane | 805.6 | Krupcik, Cellar, et al., 1986 | 0.1 K/min; Column length: 100. m; Column diameter: 0.25 mm |
Capillary | Squalane | 807.6 | Krupcik, Cellar, et al., 1986 | 0.2 K/min; Column length: 100. m; Column diameter: 0.25 mm |
Capillary | Squalane | 810.6 | Krupcik, Cellar, et al., 1986 | 0.4 K/min; Column length: 100. m; Column diameter: 0.25 mm |
Capillary | Squalane | 813.0 | Krupcik, Cellar, et al., 1986 | 0.6 K/min; Column length: 100. m; Column diameter: 0.25 mm |
Capillary | Squalane | 814.9 | Krupcik, Cellar, et al., 1986 | 0.8 K/min; Column length: 100. m; Column diameter: 0.25 mm |
Capillary | Squalane | 816.6 | Krupcik, Cellar, et al., 1986 | 1. K/min; Column length: 100. m; Column diameter: 0.25 mm |

Normal alkane RI, non-polar column, custom temperature program

Column type | Active phase | I | Reference | Comment |
---|---|---|---|---|
Capillary | Methyl Silicone | 806. | Feng and Mu, 2007 | Program: not specified |
Capillary | Methyl Silicone | 799. | Spieksma, 1999 | Program: not specified |
Capillary | OV-1, SE-30, Methyl silicone, SP-2100, OV-101, DB-1, etc. | 783. | Waggott and Davies, 1984 | Hydrogen; Column length: 50. m; Column diameter: 0.32 mm; Program: not specified |

Normal alkane RI, polar column, temperature ramp

Column type | Active phase | I | Reference | Comment |
---|---|---|---|---|
Capillary | RTX-Wax | 843. | Galindo-Cuspinera, Lubran, et al., 2002 | 60. m/0.25 mm/0.5 μm, He, 40. C @ 5. min, 5. K/min, 180. C @ 20. min |

References

Huffman H.M., 1949
Huffman H.M.,
Low-temperature thermal data on eight C8H16 alkylcyclohexanes,
J. Am. Chem. Soc., 1949, 71, 584-592. [all data]
Thermodynamics Research Center, 1997
Thermodynamics Research Center,
Selected Values of Properties of Chemical Compounds., Thermodynamics Research Center, Texas A&M University, College Station, Texas, 1997. [all data]
Beckett C.W., 1947
Beckett C.W.,
The thermodynamic properties and molecular structure of cyclohexane, methylcyclohexane, ethylcyclohexane, and seven dimethylcyclohexanes,
J. Am. Chem. Soc., 1947, 69, 2488-2495. [all data]
Johnson, Prosen, et al., 1947
Johnson, W.H.; Prosen, E.J.; Rossini, F.D.,
Heats of combustion and isomerization of the eight C8H16 alkylcyclohexanes,
J. Res. NBS, 1947, 39, 49-52. [all data]
Huffman, Todd, et al., 1949
Huffman, H.M.; Todd, S.S.; Oliver, G.D.,
Low temperature thermal data on eight C8H16 alkylcyclohexanes,
J. Am. Chem. Soc., 1949, 71, 584-592. [all data]
Streiff, Murphy, et al., 1947
Streiff, A.J.; Murphy, E.T.; Cahill, J.C.; Flanagan, H.F.; Sedlak, V.A.; Willingham, C.B.; Rossini, F.D.,
Purification, Purity, and Freezing Points of 8 Nonanes, 11 Alkyl- cyclopentanes, 6 Alkylcyclohexanes, and 4 Butylbenzenes of the API-NBS Series,
J. Res. Natl. Bur. Stand. (U. S.), 1947, 38, 53. [all data]
Forziati, Glasgow, et al., 1946
Forziati, A.F.; Glasgow, A.R.; Willingham, C.B.; Rossini, F.D.,
Specification adn Properties of 29 Paraffin, 4 Alkylcyclopentanes, 10 Alkylcyclohexanes and 8 Alkylbenzene Hydrocarbons,
J. Res. Natl. Bur. Stand. (U. S.), 1946, 36, 129. [all data]
Anonymous, 1941
Anonymous, R.,
, Am. Pet. Inst. Hydrocarbon Res. Proj., Third Annu. Rep., Ohio State Univ., Aug. 31, 1941. [all data]
Huffman, Todd, et al., 1949, 2
Huffman, H.M.; Todd, S.S.; Oliver, G.D.,
Low Temperature Thermal Data on Eight C8H16 Alkylcyclohexanes,
J. Am. Chem. Soc., 1949, 71, 584. [all data]
Huffman, 1948
Huffman, H.M.,
Personal Commun., U. S. Bur. Mines, Bartlesville, OK, 1948. [all data]
Majer and Svoboda, 1985
Majer, V.; Svoboda, V.,
Enthalpies of Vaporization of Organic Compounds: A Critical Review and Data Compilation, Blackwell Scientific Publications, Oxford, 1985, 300. [all data]
Kusano and Saito, 1975
Kusano, K.; Saito, Y.,
, Preprints 33rd Ann. Meeting Chem. Soc. Japan, Japan, 1975, 123. [all data]
Reid, 1972
Reid, Robert C.,
Handbook on vapor pressure and heats of vaporization of hydrocarbons and related compounds, R. C. Wilhort and B. J. Zwolinski, Texas A Research Foundation. College Station, Texas(1971). 329 pages.$10.00,
AIChE J., 1972, 18, 6, 1278-1278, https://doi.org/10.1002/aic.690180637
. [all data]
Osborne and Ginnings, 1947
Osborne, Nathan S.; Ginnings, Defoe C.,
Measurements of heat of vaporization and heat capacity of a number of hydrocarbons,
J. RES. NATL. BUR. STAN., 1947, 39, 5, 453-17, https://doi.org/10.6028/jres.039.031
. [all data]
Osborne and Ginnings, 1947, 2
Osborne, N.S.; Ginnings, D.C.,
Measurements of heat of vaporization and heat capacity of a number of hydrocarbons,
J. Res. NBS, 1947, 39, 453-477. [all data]
Stephenson and Malanowski, 1987
Stephenson, Richard M.; Malanowski, Stanislaw,
Handbook of the Thermodynamics of Organic Compounds, 1987, https://doi.org/10.1007/978-94-009-3173-2
. [all data]
Willingham, Taylor, et al., 1945
Willingham, C.B.; Taylor, W.J.; Pignocco, J.M.; Rossini, F.D.,
Vapor pressures and boiling points of some paraffin, alkylcyclopentane, alkylcyclohexane, and alkylbenzene hydrocarbons,
J. RES. NATL. BUR. STAN., 1945, 35, 3, 219-17, https://doi.org/10.6028/jres.035.009
. [all data]
Domalski and Hearing, 1996
Domalski, Eugene S.; Hearing, Elizabeth D.,
Heat Capacities and Entropies of Organic Compounds in the Condensed Phase. Volume III,
J. Phys. Chem. Ref. Data, 1996, 25, 1, 1, https://doi.org/10.1063/1.555985
. [all data]
Mann, 1968
Mann, G.,
Conformation and physical data of alkanes and cyclanes. IV. Conformation energy of gauche-anticonformers,
Tetrahedron, 1968, 24, 6495-65. [all data]
Holmes and Lossing, 1991
Holmes, J.L.; Lossing, F.P.,
Ionization energies of homologous organic compounds and correlation with molecular size,
Org. Mass Spectrom., 1991, 26, 537. [all data]
Sieck and Mautner(Meot-Ner), 1982
Sieck, L.W.; Mautner(Meot-Ner), M.,
Ionization energies and entropies of cycloalkanes. Kinetics of free energy controlled charge-transfer reactions,
J. Phys. Chem., 1982, 86, 3646. [all data]
Herzschuh and Sicker, 1981
Herzschuh, R.; Sicker, A.,
Stereochemische einflusse auf die ionisations- und auftrittsenergien cis/trans-isomerer dimethylcycloalkane,
Z. Chem., 1981, 21, 409. [all data]