[2H3]acetonitrile
- Formula: C2D3N
- Molecular weight: 44.0704
- CAS Registry Number: 2206-26-0

Reaction thermochemistry data

Data compiled by: Michael M. Meot-Ner (Mautner) and Sharon G. Lias
Individual Reactions
( • 2C2D3N) + C2D3N = (
• 3C2D3N)
By formula: (C5H5- • 2C2D3N) + C2D3N = (C5H5- • 3C2D3N)
Quantity | Value | Units | Method | Reference | Comment |
---|---|---|---|---|---|
ΔrH° | 42.7 | kJ/mol | PHPMS | Meot-ner, 1988 | gas phase; Entropy change calculated or estimated, ΔrH<, CD3CN |
Quantity | Value | Units | Method | Reference | Comment |
ΔrS° | 92. | J/mol*K | N/A | Meot-ner, 1988 | gas phase; Entropy change calculated or estimated, ΔrH<, CD3CN |
Free energy of reaction
ΔrG° (kJ/mol) | T (K) | Method | Reference | Comment |
---|---|---|---|---|
21. | 232. | PHPMS | Meot-ner, 1988 | gas phase; Entropy change calculated or estimated, ΔrH<, CD3CN |
( • C2D3N) + C2D3N = (
• 2C2D3N)
By formula: (C5H5- • C2D3N) + C2D3N = (C5H5- • 2C2D3N)
Quantity | Value | Units | Method | Reference | Comment |
---|---|---|---|---|---|
ΔrH° | 54.8 | kJ/mol | PHPMS | Meot-ner, 1988 | gas phase; CD3CN |
Quantity | Value | Units | Method | Reference | Comment |
ΔrS° | 95.4 | J/mol*K | PHPMS | Meot-ner, 1988 | gas phase; CD3CN |
By formula: C5H5- + C2D3N = (C5H5- • C2D3N)
Quantity | Value | Units | Method | Reference | Comment |
---|---|---|---|---|---|
ΔrH° | 64.9 | kJ/mol | PHPMS | Meot-ner, 1988 | gas phase |
Quantity | Value | Units | Method | Reference | Comment |
ΔrS° | 95.4 | J/mol*K | PHPMS | Meot-ner, 1988 | gas phase |

Gas phase ion energetics data

Data compiled as indicated in comments:
RDSH - Henry M. Rosenstock, Keith Draxl, Bruce W. Steiner, and John T. Herron
B - John E. Bartmess
Electron affinity determinations
EA (eV) | Method | Reference | Comment |
---|---|---|---|
0.01101 | EFD | Suess, Liu, et al., 2003 | B |
Ionization energy determinations
IE (eV) | Method | Reference | Comment |
---|---|---|---|
13.14 | PE | Lake and Thompson, 1970 | RDSH |
15.17 | PE | Lake and Thompson, 1970 | RDSH |
12.29 ± 0.05 | EI | Franklin, Wada, et al., 1966 | RDSH |
12.23 | PE | Lake and Thompson, 1970 | Vertical value; RDSH |

Ion clustering data

Data compiled by: Michael M. Meot-Ner (Mautner) and Sharon G. Lias
Clustering reactions
By formula: C5H5- + C2D3N = (C5H5- • C2D3N)
Quantity | Value | Units | Method | Reference | Comment |
---|---|---|---|---|---|
ΔrH° | 64.9 | kJ/mol | PHPMS | Meot-ner, 1988 | gas phase |
Quantity | Value | Units | Method | Reference | Comment |
ΔrS° | 95.4 | J/mol*K | PHPMS | Meot-ner, 1988 | gas phase |
( • C2D3N) + C2D3N = (
• 2C2D3N)
By formula: (C5H5- • C2D3N) + C2D3N = (C5H5- • 2C2D3N)
Quantity | Value | Units | Method | Reference | Comment |
---|---|---|---|---|---|
ΔrH° | 54.8 | kJ/mol | PHPMS | Meot-ner, 1988 | gas phase; CD3CN |
Quantity | Value | Units | Method | Reference | Comment |
ΔrS° | 95.4 | J/mol*K | PHPMS | Meot-ner, 1988 | gas phase; CD3CN |
( • 2C2D3N) + C2D3N = (
• 3C2D3N)
By formula: (C5H5- • 2C2D3N) + C2D3N = (C5H5- • 3C2D3N)
Quantity | Value | Units | Method | Reference | Comment |
---|---|---|---|---|---|
ΔrH° | 42.7 | kJ/mol | PHPMS | Meot-ner, 1988 | gas phase; Entropy change calculated or estimated, ΔrH<, CD3CN |
Quantity | Value | Units | Method | Reference | Comment |
ΔrS° | 92. | J/mol*K | N/A | Meot-ner, 1988 | gas phase; Entropy change calculated or estimated, ΔrH<, CD3CN |
Free energy of reaction
ΔrG° (kJ/mol) | T (K) | Method | Reference | Comment |
---|---|---|---|---|
21. | 232. | PHPMS | Meot-ner, 1988 | gas phase; Entropy change calculated or estimated, ΔrH<, CD3CN |

Vibrational and/or electronic energy levels

Data compiled by: Takehiko Shimanouchi
Symmetry: C3ν Symmetry Number σ = 3
Sym. | No | Approximate | Selected Freq. | Infrared | Raman | Comments | ||||
---|---|---|---|---|---|---|---|---|---|---|
Species | type of mode | Value | Rating | Value | Phase | Value | Phase | |||
a1 | 1 | CD3 s-str | 2126 | A | 2125.6 | gas | 2112 S | liq. | ||
a1 | 2 | CN str | 2278 | A | 2277.6 | gas | 2258 S | liq. | ||
a1 | 3 | CD3 s-deform | 1110 | B | 1110 | gas | 1103 W | liq. | ||
a1 | 4 | CC str | 831 | A | 831.3 | gas | 834 W | liq. | ||
e | 5 | CD3 d-str | 2257 | A | 2256.6 | gas | 2258 S | liq. | ||
e | 6 | CD3 d-deform | 1046 | A | 1046.4 | gas | 1041 W | liq. | ||
e | 7 | CD3 rock | 847 | A | 846.6 | gas | ||||
e | 8 | CCN bend | 331 | B | 331.2 | gas | 348 M | liq. | ||
Source: Shimanouchi, 1972

References

Meot-ner, 1988
Meot-ner, M.,
The Ionic Hydrogen Bond and Solvation. 7. Interaction Energies of Carbanions with Solvent Molecules,
J. Am. Chem. Soc., 1988, 110, 12, 3858, https://doi.org/10.1021/ja00220a022
. [all data]
Suess, Liu, et al., 2003
Suess, L.; Liu, Y.; Parthasarathy, R.; Dunning, F.B.,
Dipole-bound negative ions: Collisional destruction and blackbody-radiation-induced photodetachment,
J. Chem. Phys., 2003, 119, 24, 12890-12894, https://doi.org/10.1063/1.1628215
. [all data]
Lake and Thompson, 1970
Lake, R.F.; Thompson, H.,
The photoelectron spectra of some molecules containing the C N group,
Proc. Roy. Soc. (London), 1970, A317, 187. [all data]
Franklin, Wada, et al., 1966
Franklin, J.L.; Wada, Y.; Natalis, P.; Hierl, P.M.,
Ion-molecule reactions in acetonitrile and propionitrile,
J. Phys. Chem., 1966, 70, 2353. [all data]