But-1-yne-3-ene, 4-dimethylamino-
- Formula: C6H9N
- Molecular weight: 95.1424
- IUPAC Standard InChIKey: RPGUSJXDACYPMP-AATRIKPKSA-N
- CAS Registry Number: 2206-24-8
- Chemical structure:
View 3d structure (requires JavaScript / HTML 5) - Permanent link for this species. Use this link for bookmarking this species for future reference.

Gas phase ion energetics data

Data compiled as indicated in comments:
RDSH - Henry M. Rosenstock, Keith Draxl, Bruce W. Steiner, and John T. Herron
Ionization energy determinations
IE (eV) | Method | Reference | Comment |
---|---|---|---|
7.7 | EI | Plotnikov, Bogolyubov, et al., 1969 | RDSH |
Appearance energy determinations
Ion | AE (eV) | Other Products | Method | Reference | Comment |
---|---|---|---|---|---|
C2H4N+ | 13.1 | ? | EI | Plotnikov, Bogolyubov, et al., 1969 | RDSH |
C2H6N+ | 12.7 | CH=CHCðCH | EI | Plotnikov, Bogolyubov, et al., 1969 | RDSH |
C3H3+ | 15.2 | ? | EI | Plotnikov, Bogolyubov, et al., 1969 | RDSH |
C4H3+ | 14.4 | ? | EI | Plotnikov, Bogolyubov, et al., 1969 | RDSH |
C4H3N+ | 15.1 | 2CH3 | EI | Plotnikov, Bogolyubov, et al., 1969 | RDSH |
C4H4+ | 13.4 | CH2=NH+CH3 | EI | Plotnikov, Bogolyubov, et al., 1969 | RDSH |
C5H4N+ | 12.4 | CH3+H2 | EI | Plotnikov, Bogolyubov, et al., 1969 | RDSH |
C5H6N+ | 11.2 | CH3 | EI | Plotnikov, Bogolyubov, et al., 1969 | RDSH |
C6H8N+ | 10.1 | H | EI | Plotnikov, Bogolyubov, et al., 1969 | RDSH |

References

Plotnikov, Bogolyubov, et al., 1969
Plotnikov, V.F.; Bogolyubov, G.M.; Maretina, I.A.; Petrov, A.A.,
Organic derivatives of elements of Groups V and VI. V. Mass spectra of 1-buten-3-ynylamines,
Zh. Org. Khim., 1969, 5, 1137, In original 1157. [all data]