Furan, 3-bromo-
- Formula: C4H3BrO
- Molecular weight: 146.970
- IUPAC Standard InChIKey: LXWLEQZDXOQZGW-UHFFFAOYSA-N
- CAS Registry Number: 22037-28-1
- Chemical structure:
View 3d structure (requires JavaScript / HTML 5) - Other names: β-Bromofuran; 3-Bromofuran

Phase change data

Data compiled by: Robert L. Brown and Stephen E. Stein
Quantity | Value | Units | Method | Reference | Comment |
---|---|---|---|---|---|
Tboil | 376.2 | K | N/A | Weast and Grasselli, 1989 |

Gas phase ion energetics data

Data compiled by: Sharon G. Lias, Rhoda D. Levin, and Sherif A. Kafafi
Ionization energy determinations
IE (eV) | Method | Reference |
---|---|---|
9.14 | CTS | Aloisi, Santini, et al., 1975 |

References

Weast and Grasselli, 1989
CRC Handbook of Data on Organic Compounds, 2nd Editon, Weast,R.C and Grasselli, J.G., ed(s)., CRC Press, Inc., Boca Raton, FL, 1989, 1. [all data]
Aloisi, Santini, et al., 1975
Aloisi, G.; Santini, S.; Savelli, G.,
Molecular complexes of heteroaromatic five membered ring compounds with tetracyanoethylene. Charge transfer spectra, equilibrium constants and ionization potentials of the donors,
J. Chem. Soc. Faraday Trans. 1, 1975, 70, 2045. [all data]