1,2,3,4-Pentatetraene
- Formula: C5H4
- Molecular weight: 64.0853
- IUPAC Standard InChIKey: UNSWNZFTRPSXHQ-UHFFFAOYSA-N
- CAS Registry Number: 21986-03-8
- Chemical structure:
View 3d structure (requires JavaScript / HTML 5) - Permanent link for this species. Use this link for bookmarking this species for future reference.

Gas phase ion energetics data

Data compiled as indicated in comments:
LLK - Sharon G. Lias, Rhoda D. Levin, and Sherif A. Kafafi
Ionization energy determinations
IE (eV) | Method | Reference | Comment |
---|---|---|---|
8.67 | PE | Bieri, Dill, et al., 1977 | LLK |
8.67 ± 0.02 | PE | Bieri, Burger, et al., 1977 | LLK |

References

Bieri, Dill, et al., 1977
Bieri, G.; Dill, J.D.; Heilbronner, E.; Maier, J.P.,
68. The electronic states of the pentatetraene radical cation,
Helv. Chim. Acta, 1977, 60, 629. [all data]
Bieri, Burger, et al., 1977
Bieri, G.; Burger, F.; Heilbronner, E.; Maier, J.P.,
Valence ionization enrgies of hydrocarbons,
Helv. Chim. Acta, 1977, 60, 2213. [all data]