Cyclodecene, (E)-
- Formula: C10H18
- Molecular weight: 138.2499
- IUPAC Standard InChIKey: UCIYGNATMHQYCT-OWOJBTEDSA-N
- CAS Registry Number: 2198-20-1
- Chemical structure:
View 3d structure (requires JavaScript / HTML 5) - Species with the same structure:
- Stereoisomers:
- Other names: trans-Cyclodecene; (E)-Cyclodecene

Phase change data

Data compiled as indicated in comments:
TRC - Thermodynamics Research Center, NIST Boulder Laboratories, Chris Muzny director
BS - Robert L. Brown and Stephen E. Stein
Quantity | Value | Units | Method | Reference | Comment |
---|---|---|---|---|---|
Tboil | 472. | K | N/A | Turner and Meador, 1957 | Uncertainty assigned by TRC = 2. K; TRC |
Reduced pressure boiling point
Tboil (K) | Pressure (bar) | Reference | Comment |
---|---|---|---|
342.2 | 0.013 | Weast and Grasselli, 1989 | BS |

Reaction thermochemistry data

Data compiled by: Hussein Y. Afeefy, Joel F. Liebman, and Stephen E. Stein
Individual Reactions
By formula: H2 + C10H18 = C10H20
Quantity | Value | Units | Method | Reference | Comment |
---|---|---|---|---|---|
ΔrH° | -100. ± 4. | kJ/mol | Chyd | Turner and Meador, 1957, 2 | liquid phase; solvent: Acetic acid |
By formula: C10H18 = C10H18
Quantity | Value | Units | Method | Reference | Comment |
---|---|---|---|---|---|
ΔrH° | -14.9 ± 0.3 | kJ/mol | Eqk | Taskinen, 1980 | liquid phase; solvent: Acetic acid |

Gas phase ion energetics data

Data compiled as indicated in comments:
LLK - Sharon G. Lias, Rhoda D. Levin, and Sherif A. Kafafi
RDSH - Henry M. Rosenstock, Keith Draxl, Bruce W. Steiner, and John T. Herron
Ionization energy determinations
IE (eV) | Method | Reference | Comment |
---|---|---|---|
8.91 ± 0.15 | EI | Remane, Graefe, et al., 1972 | LLK |
8.80 | PE | Bischof and Heilbronner, 1970 | RDSH |

Kovats' RI, non-polar column, isothermal

Column type | Active phase | Temperature (C) | I | Reference | Comment |
---|---|---|---|---|---|
Capillary | OV-1 | 100. | 1107.1 | Engewald, Billing, et al., 1987 | Column length: 50. m; Column diameter: 0.3 mm |
Packed | Squalane | 100. | 1115. | Bogoslovsky, Anvaer, et al., 1978 | |
Packed | Squalane | 120. | 1122. | Bogoslovsky, Anvaer, et al., 1978 | |
Capillary | Squalane | 120. | 1120. | Engewald, Epsch, et al., 1974 | N2; Column length: 100. m; Column diameter: 0.23 mm |
Capillary | Squalane | 100. | 1115. | Schomburg, 1967 | Ar; Column length: 100. m |
Capillary | Squalane | 120. | 1122. | Schomburg, 1966 | |
Capillary | Squalane | 120. | 1122. | Schomburg, 1966 |

Kovats' RI, polar column, isothermal

Column type | Active phase | Temperature (C) | I | Reference | Comment |
---|---|---|---|---|---|
Capillary | Carbowax 40M | 150. | 1539.8 | Rudenko and Rudenko, 2005 | He; Column diameter: 0.25 mm |
Capillary | Carbowax 40M | 170. | 1557.9 | Rudenko and Rudenko, 2005 | He; Column diameter: 0.25 mm |
Capillary | Carbowax 40M | 190. | 1577.9 | Rudenko and Rudenko, 2005 | He; Column diameter: 0.25 mm |

Normal alkane RI, non-polar column, custom temperature program

Column type | Active phase | I | Reference | Comment |
---|---|---|---|---|
Capillary | Squalane | 1122. | Chen, 2008 | Program: not specified |

References

Turner and Meador, 1957
Turner, R.B.; Meador, W.R.,
J. Am. Chem. Soc., 1957, 79, 4133. [all data]
Weast and Grasselli, 1989
CRC Handbook of Data on Organic Compounds, 2nd Editon, Weast,R.C and Grasselli, J.G., ed(s)., CRC Press, Inc., Boca Raton, FL, 1989, 1. [all data]
Turner and Meador, 1957, 2
Turner, R.B.; Meador, W.R.,
Heats of hydrogenation. IV. Hydrogenation of some cis- and trans-cycloolefins,
J. Am. Chem. Soc., 1957, 79, 4133-4136. [all data]
Taskinen, 1980
Taskinen, E.,
Thermodynamics of vinyl ethers. XXVI. Relative stabilities of the geometrical isomers of 8- to 15-membered 1-methoxycycloalkenes,
Acta Chem. Scand., Ser. B, 1980, 643-646. [all data]
Remane, Graefe, et al., 1972
Remane, H.; Graefe, J.; Herzschuh, R.,
Ionisationspotentiale von cis- und trans-Cycloalkenen,
Z. Chem., 1972, 12, 194. [all data]
Bischof and Heilbronner, 1970
Bischof, P.; Heilbronner, E.,
Photoelektron-Spektren von Cycloalkenen und Cycloalkadienen,
Helv. Chim. Acta, 1970, 53, 1677. [all data]
Engewald, Billing, et al., 1987
Engewald, W.; Billing, U.; Welsch, T.; Haufe, G.,
Structure-retention correlations of hydrocarbons in gas-liquid and gas-solid chromatography. Cycloalkenes and cycloalkadienes,
Chromatographia, 1987, 23, 8, 590-594, https://doi.org/10.1007/BF02324870
. [all data]
Bogoslovsky, Anvaer, et al., 1978
Bogoslovsky, Yu.N.; Anvaer, B.I.; Vigdergauz, M.S.,
Chromatographic constants in gas chromatography (in Russian), Standards Publ. House, Moscow, 1978, 192. [all data]
Engewald, Epsch, et al., 1974
Engewald, W.; Epsch, K.; Graefe, J.; Welsch, Th.,
Molekülstruktur und retentionsverhalten. II. Retentionsverhalten cycloaliphatischer kohlenwasser-stoffe bei der gas-adsorptions- und gas-verteilungschromatographie,
J. Chromatogr., 1974, 91, 623-631, https://doi.org/10.1016/S0021-9673(01)97943-9
. [all data]
Schomburg, 1967
Schomburg, G.,
Struktur und Retentionsverhalten von Offenkettigen und Cyclischen Kohlenwasserstoffen und Deren Einfacher Substitutionsprodukte,
Anal. Chim. Acta., 1967, 38, 45-64, https://doi.org/10.1016/S0003-2670(01)80560-2
. [all data]
Schomburg, 1966
Schomburg, G.,
Gaschromatographische Retentionsdaten und struktur chemischer verbindungen. III. Alkylverzweigte und ungesättigte cyclische Kohlenwasserstoffe,
J. Chromatogr., 1966, 23, 18-41, https://doi.org/10.1016/S0021-9673(01)98653-4
. [all data]
Rudenko and Rudenko, 2005
Rudenko, B.A.; Rudenko, G.I.,
Gas chromatography with open tubular columns of cyclododecane derivatives,
J. Anal. Chem. USSR (Engl. Transl.), 2005, 60, 4, 345-348. [all data]
Chen, 2008
Chen, H.-F.,
Quantitative prediction of gas chromatography retention indices with support vector machines, radial basis neutral networks and multiple linear regression,
Anal. Chim. Acta, 2008, 609, 1, 24-36, https://doi.org/10.1016/j.aca.2008.01.003
. [all data]