2-Benzylideneamino-2,1,3-benzotriazole
- Formula: C13H10N4
- Molecular weight: 222.2453
- IUPAC Standard InChIKey: JHHYYGTUYDAKCM-UVTDQMKNSA-N
- CAS Registry Number: 21978-61-0
- Chemical structure:
View 3d structure (requires JavaScript / HTML 5) - Permanent link for this species. Use this link for bookmarking this species for future reference.

Gas phase ion energetics data

Data compiled by: Henry M. Rosenstock, Keith Draxl, Bruce W. Steiner, and John T. Herron
Appearance energy determinations
Ion | AE (eV) | Other Products | Method | Reference | Comment |
---|---|---|---|---|---|
C12H9N+ | 10.4 ± 0.1 | ? | EDD | Rapp, Staab, et al., 1970 |

References

Rapp, Staab, et al., 1970
Rapp, U.; Staab, H.A.; Wunsche, C.,
Skelettumlagerungen unter Elektronenbeschuss-IV: zur Struktur der C13H9- und C12H9N-Ionen bei Benzylidenaminobenztriazolen,
Org. Mass Spectrom., 1970, 3, 45. [all data]