N,N-Diethyl-N',N'-dimethylhydrazine
- Formula: C6H16N2
- Molecular weight: 116.2046
- IUPAC Standard InChIKey: SGIKAVNBVLFQSG-UHFFFAOYSA-N
- CAS Registry Number: 21849-74-1
- Chemical structure:
View 3d structure (requires JavaScript / HTML 5) - Permanent link for this species. Use this link for bookmarking this species for future reference.

Gas phase ion energetics data

Data compiled as indicated in comments:
LBLHLM - Sharon G. Lias, John E. Bartmess, Joel F. Liebman, John L. Holmes, Rhoda D. Levin, and W. Gary Mallard
LLK - Sharon G. Lias, Rhoda D. Levin, and Sherif A. Kafafi
Ionization energy determinations
IE (eV) | Method | Reference | Comment |
---|---|---|---|
8.37 | PE | Nelsen, 1984 | Vertical value; LBLHLM |
8.365 | PE | Nelsen and Buschek, 1974 | Vertical value; LLK |
8.10 | PE | Nelsen and Buschek, 1974, 2 | Vertical value; LLK |
Appearance energy determinations
Ion | AE (eV) | Other Products | Method | Reference | Comment |
---|---|---|---|---|---|
C6H16N2+ | 8.10 | ? | PE | Nelsen, Peacock, et al., 1976 | Vertical value; LLK |

References

Nelsen, 1984
Nelsen, S.F.,
Ionization from nitrogen and oxygen lone pairs: A comparison of trialkylamine, dialkyl ether, tetraalkylhydrazine, and dialkyl peroxide photoelectron spectroscopic ionization potentials,
J. Org. Chem., 1984, 49, 1891. [all data]
Nelsen and Buschek, 1974
Nelsen, S.F.; Buschek, J.M.,
Photoelectron spectra of hydrazines. IV. Empirical estimation of lone pair-lone pair dihedral angles and prediction of lone pair ionization potentials for some cyclic and bicyclic hydrazines,
J. Am. Chem. Soc., 1974, 96, 6982. [all data]
Nelsen and Buschek, 1974, 2
Nelsen, S.F.; Buschek, J.M.,
Photoelectron spectra of hydrazines. III. Evidence for similar lone pair-lone pair dihedral angles for acyclic hydrazines,
J. Am. Chem. Soc., 1974, 96, 2392. [all data]
Nelsen, Peacock, et al., 1976
Nelsen, S.F.; Peacock, V.; Weisman, G.R.,
Single-electron oxidation equilibria of tetraalkylhydrazines. Comparison of solution E° values and vapor-phase ionization potentials,
J. Am. Chem. Soc., 1976, 98, 5269. [all data]