Chrysene
- Formula: C18H12
- Molecular weight: 228.2879
- IUPAC Standard InChIKey: WDECIBYCCFPHNR-UHFFFAOYSA-N
- CAS Registry Number: 218-01-9
- Chemical structure:
View 3d structure (requires JavaScript / HTML 5) - Isotopologues:
- Other names: Benzo[a]phenanthrene; 1,2-Benzophenanthrene; 1,2-Benzphenanthrene; Benz(a)phenanthrene; 1,2,5,6-Dibenzonaphthalene; Rcra waste number U050; Crysene

Gas phase thermochemistry data

Data compiled as indicated in comments:
DRB - Donald R. Burgess, Jr.
GT - Glushko Thermocenter, Russian Academy of Sciences, Moscow
Quantity | Value | Units | Method | Reference | Comment |
---|---|---|---|---|---|
ΔfH°gas | 268.7 ± 4.7 | kJ/mol | Review | Roux, Temprado, et al., 2008 | There are insufficient literature values to properly evaluate the data and insufficient information to construct thermochemical cycles or estimate values for comparison, and one must rely solely upon reported uncertainities and the quality of the measurements. In general, the evaluated uncertainty limits are on the order of (3 to 9) kJ/mol.; DRB |
Constant pressure heat capacity of gas
Cp,gas (J/mol*K) | Temperature (K) | Reference | Comment |
---|---|---|---|
49.04 | 50. | Dorofeeva O.V., 1988 | Recommended values were calculated statistically mechanically using force field approximation for polycyclic aromatic hydrocarbons to estimate the needed vibrational frequencies (see also [ Dorofeeva O.V., 1986, Moiseeva N.F., 1989]). These functions are reproduced in the reference book [ Frenkel M., 1994].; GT |
77.74 | 100. | ||
112.13 | 150. | ||
151.58 | 200. | ||
213.86 | 273.15 | ||
235.3 ± 1.5 | 298.15 | ||
236.83 | 300. | ||
316.92 | 400. | ||
383.72 | 500. | ||
437.14 | 600. | ||
479.80 | 700. | ||
514.32 | 800. | ||
542.66 | 900. | ||
566.21 | 1000. | ||
585.96 | 1100. | ||
602.65 | 1200. | ||
616.85 | 1300. | ||
628.99 | 1400. | ||
639.44 | 1500. |

Condensed phase thermochemistry data

Data compiled as indicated in comments:
DRB - Donald R. Burgess, Jr.
ALS - Hussein Y. Afeefy, Joel F. Liebman, and Stephen E. Stein
Quantity | Value | Units | Method | Reference | Comment |
---|---|---|---|---|---|
ΔfH°solid | 145.3 ± 2.2 | kJ/mol | Review | Roux, Temprado, et al., 2008 | There are insufficient literature values to properly evaluate the data and insufficient information to construct thermochemical cycles or estimate values for comparison, and one must rely solely upon reported uncertainities and the quality of the measurements. In general, the evaluated uncertainty limits are on the order of (3 to 9) kJ/mol.; DRB |
Quantity | Value | Units | Method | Reference | Comment |
ΔcH°solid | -8943.4 ± 2.1 | kJ/mol | Ccb | Magnus, Hartmann, et al., 1951 | Reanalyzed by Cox and Pilcher, 1970, Original value = -8943.8 ± 2.1 kJ/mol; Corresponding ΔfHºsolid = 145.3 kJ/mol (simple calculation by NIST; no Washburn corrections); ALS |

Phase change data

Data compiled as indicated in comments:
BS - Robert L. Brown and Stephen E. Stein
TRC - Thermodynamics Research Center, NIST Boulder Laboratories, Chris Muzny director
AC - William E. Acree, Jr., James S. Chickos
DRB - Donald R. Burgess, Jr.
ALS - Hussein Y. Afeefy, Joel F. Liebman, and Stephen E. Stein
CAL - James S. Chickos, William E. Acree, Jr., Joel F. Liebman, Students of Chem 202 (Introduction to the Literature of Chemistry), University of Missouri -- St. Louis
Quantity | Value | Units | Method | Reference | Comment |
---|---|---|---|---|---|
Tboil | 721.2 | K | N/A | Weast and Grasselli, 1989 | BS |
Quantity | Value | Units | Method | Reference | Comment |
Tfus | 531.4 | K | N/A | Casellato, Vecchi, et al., 1973 | Uncertainty assigned by TRC = 0.2 K; TRC |
Tfus | 529.0 | K | N/A | Sangster and Irvine, 1956 | Uncertainty assigned by TRC = 2. K; TRC |
Tfus | 527.35 | K | N/A | Schuyer, Blom, et al., 1953 | Uncertainty assigned by TRC = 1. K; TRC |
Tfus | 529.2 | K | N/A | Jones and Neuworth, 1944 | Uncertainty assigned by TRC = 1. K; TRC |
Tfus | 527.9 | K | N/A | Baxter and Hale, 1936 | Uncertainty assigned by TRC = 0.5 K; TRC |
Quantity | Value | Units | Method | Reference | Comment |
ΔvapH° | 106.2 | kJ/mol | CGC | Zhao, Unhannanant, et al., 2008 | AC |
ΔvapH° | 97.0 ± 1.4 | kJ/mol | GC | Haftka, Parsons, et al., 2006 | Based on data from 463. to 513. K.; AC |
Quantity | Value | Units | Method | Reference | Comment |
ΔsubH° | 123.4 ± 4.2 | kJ/mol | Review | Roux, Temprado, et al., 2008 | There are sufficient literature values to make a qualified recommendation where the suggested value is in good agreement with values predicted using thermochemical cycles or from reliable estimates. In general, the evaluated uncertainty limits are on the order of (2 to 4) kJ/mol.; DRB |
ΔsubH° | 131. ± 4. | kJ/mol | V | Kruif, 1980 | ALS |
ΔsubH° | 131. ± 4. | kJ/mol | TE,ME | Kruif, 1980 | AC |
Enthalpy of vaporization
ΔvapH (kJ/mol) | Temperature (K) | Method | Reference | Comment |
---|---|---|---|---|
89.6 | 398. | GC | Lei, Chankalal, et al., 2002 | Based on data from 323. to 473. K.; AC |
Enthalpy of sublimation
ΔsubH (kJ/mol) | Temperature (K) | Method | Reference | Comment |
---|---|---|---|---|
118.8 | 383. | GS | Nass, Lenoir, et al., 1995 | Based on data from 313. to 453. K.; AC |
118. ± 4. | 400. | ME | Wakayama and Inokuchi, 1967 | See also Cox and Pilcher, 1970, 2.; AC |
121.4 | 385. | N/A | Hoyer and Peperle, 1958 | Based on data from 353. to 418. K.; AC |
119. | 353. | V | Hoyer and Peperle, 1958, 2 | ALS |
118. | 293. | V | Magnus, Hartmann, et al., 1951 | ALS |
Enthalpy of fusion
ΔfusH (kJ/mol) | Temperature (K) | Method | Reference | Comment |
---|---|---|---|---|
23.6 | 527. | DSC | Kestens, Auclair, et al., 2010 | AC |
26.15 | 531.4 | DSC | Casellato, Vecchi, et al., 1973, 2 | AC |
Entropy of fusion
ΔfusS (J/mol*K) | Temperature (K) | Reference | Comment |
---|---|---|---|
6.29 | 512.2 | Casellato, Vecchi, et al., 1973 | CAL |
49.21 | 531.4 |

Reaction thermochemistry data

Data compiled by: Michael M. Meot-Ner (Mautner) and Sharon G. Lias
Individual Reactions
By formula: C18H12+ + C18H12 = (C18H12+ • C18H12)
Bond type: Charge transfer bond (positive ion)
Quantity | Value | Units | Method | Reference | Comment |
---|---|---|---|---|---|
ΔrH° | 76.1 | kJ/mol | PHPMS | Meot-Ner (Mautner), 1980 | gas phase; Entropy change calculated or estimated |
Quantity | Value | Units | Method | Reference | Comment |
ΔrS° | 120. | J/mol*K | N/A | Meot-Ner (Mautner), 1980 | gas phase; Entropy change calculated or estimated |
Free energy of reaction
ΔrG° (kJ/mol) | T (K) | Method | Reference | Comment |
---|---|---|---|---|
26. | 418. | PHPMS | Meot-Ner (Mautner), 1980 | gas phase; Entropy change calculated or estimated |
By formula: C18H13+ + C18H12 = (C18H13+ • C18H12)
Quantity | Value | Units | Method | Reference | Comment |
---|---|---|---|---|---|
ΔrH° | 74.5 | kJ/mol | PHPMS | Meot-Ner (Mautner), 1980 | gas phase; Entropy change calculated or estimated |
Quantity | Value | Units | Method | Reference | Comment |
ΔrS° | 120. | J/mol*K | N/A | Meot-Ner (Mautner), 1980 | gas phase; Entropy change calculated or estimated |
Free energy of reaction
ΔrG° (kJ/mol) | T (K) | Method | Reference | Comment |
---|---|---|---|---|
23. | 418. | PHPMS | Meot-Ner (Mautner), 1980 | gas phase; Entropy change calculated or estimated |

Gas phase ion energetics data

Data evaluated as indicated in comments:
HL - Edward P. Hunter and Sharon G. Lias
L - Sharon G. Lias
Data compiled as indicated in comments:
MM - Michael M. Meot-Ner (Mautner)
LLK - Sharon G. Lias, Rhoda D. Levin, and Sherif A. Kafafi
RDSH - Henry M. Rosenstock, Keith Draxl, Bruce W. Steiner, and John T. Herron
B - John E. Bartmess
Quantity | Value | Units | Method | Reference | Comment |
---|---|---|---|---|---|
IE (evaluated) | 7.60 ± 0.01 | eV | N/A | N/A | L |
Quantity | Value | Units | Method | Reference | Comment |
Proton affinity (review) | 840.9 | kJ/mol | N/A | Hunter and Lias, 1998 | HL |
Quantity | Value | Units | Method | Reference | Comment |
Gas basicity | 810.1 | kJ/mol | N/A | Hunter and Lias, 1998 | HL |
Electron affinity determinations
EA (eV) | Method | Reference | Comment |
---|---|---|---|
0.320 ± 0.010 | LPES | Tschurl and Boesl, 2006 | B |
0.3970 ± 0.0080 | ECD | Becker and Chen, 1966 | B |
0.33 | ECD | Wentworth and Becker, 1962 | B |
Proton affinity at 298K
Proton affinity (kJ/mol) | Reference | Comment |
---|---|---|
828.9 | Aue, Guidoni, et al., 2000 | Experimental literature data re-evaluated by the authors using ab initio protonation entropies; MM |
Gas basicity at 298K
Gas basicity (review) (kJ/mol) | Reference | Comment |
---|---|---|
804.6 | Aue, Guidoni, et al., 2000 | Experimental literature data re-evaluated by the authors using ab initio protonation entropies; MM |
Ionization energy determinations
IE (eV) | Method | Reference | Comment |
---|---|---|---|
7.60 ± 0.03 | PE | Shahbaz, Akiyama, et al., 1981 | LLK |
8.0 ± 0.2 | EI | Shushan and Boyd, 1980 | LLK |
7.59 ± 0.05 | EQ | Mautner(Meot-Ner), 1980 | LLK |
7.60 ± 0.01 | PE | Boschi, Murrell, et al., 1972 | LLK |
8.0 ± 0.3 | EI | Wacks, 1964 | RDSH |
7.82 | CTS | Kuroda, 1964 | RDSH |
7.83 | CTS | Briegleb, 1964 | RDSH |
7.68 | CTS | Kinoshita, 1962 | RDSH |
7.75 | CTS | Briegleb, Czekalla, et al., 1961 | RDSH |
7.80 | CTS | Birks and Stifkin, 1961 | RDSH |
7.78 | CTS | Briegleb and Czekalla, 1959 | RDSH |
7.72 | CTS | Matsen, 1956 | RDSH |
7.59 ± 0.02 | PE | Schmidt, 1977 | Vertical value; LLK |
7.59 | PE | Clar and Schmidt, 1976 | Vertical value; LLK |
7.61 | PE | Brogli and Heilbronner, 1972 | Vertical value; LLK |
Appearance energy determinations
Ion | AE (eV) | Other Products | Method | Reference | Comment |
---|---|---|---|---|---|
C16H10+ | 16.6 ± 0.3 | C2H2 | EI | Shushan and Boyd, 1980 | LLK |
C18H11+ | 15.1 ± 0.3 | H | EI | Shushan and Boyd, 1980 | LLK |

Ion clustering data

Data compiled by: Michael M. Meot-Ner (Mautner) and Sharon G. Lias
Clustering reactions
By formula: C18H12+ + C18H12 = (C18H12+ • C18H12)
Bond type: Charge transfer bond (positive ion)
Quantity | Value | Units | Method | Reference | Comment |
---|---|---|---|---|---|
ΔrH° | 76.1 | kJ/mol | PHPMS | Meot-Ner (Mautner), 1980 | gas phase; Entropy change calculated or estimated |
Quantity | Value | Units | Method | Reference | Comment |
ΔrS° | 120. | J/mol*K | N/A | Meot-Ner (Mautner), 1980 | gas phase; Entropy change calculated or estimated |
Free energy of reaction
ΔrG° (kJ/mol) | T (K) | Method | Reference | Comment |
---|---|---|---|---|
26. | 418. | PHPMS | Meot-Ner (Mautner), 1980 | gas phase; Entropy change calculated or estimated |
By formula: C18H13+ + C18H12 = (C18H13+ • C18H12)
Quantity | Value | Units | Method | Reference | Comment |
---|---|---|---|---|---|
ΔrH° | 74.5 | kJ/mol | PHPMS | Meot-Ner (Mautner), 1980 | gas phase; Entropy change calculated or estimated |
Quantity | Value | Units | Method | Reference | Comment |
ΔrS° | 120. | J/mol*K | N/A | Meot-Ner (Mautner), 1980 | gas phase; Entropy change calculated or estimated |
Free energy of reaction
ΔrG° (kJ/mol) | T (K) | Method | Reference | Comment |
---|---|---|---|---|
23. | 418. | PHPMS | Meot-Ner (Mautner), 1980 | gas phase; Entropy change calculated or estimated |

Van Den Dool and Kratz RI, non-polar column, temperature ramp

Data compiled by: NIST Mass Spectrometry Data Center, William E. Wallace, director

Column type CapillaryCapillaryCapillaryCapillaryCapillary
Active phase DB-5DB-5DB-5DB-5DB-5
Column length (m) 30.30.30.30.30.
Carrier gas HeHeHeHeHe
Substrate
Column diameter (mm) 0.250.250.250.250.25
Phase thickness (μm) 0.250.250.250.250.25
Tstart (C) 40.40.40.40.40.
Tend (C) 310.310.310.310.310.
Heat rate (K/min) 4.4.2.4.6.
Initial hold (min)  5.
Final hold (min)
I 2472.32471.82434.22472.32494.9
ReferenceSong, Lai, et al., 2003Song, Lai, et al., 2003Song, Lai, et al., 2003Song, Lai, et al., 2003Song, Lai, et al., 2003
Comment MSDC-RI MSDC-RI MSDC-RI MSDC-RI MSDC-RI
Column type CapillaryCapillaryCapillaryCapillaryCapillary
Active phase OV-1Ultra-1OV-1DB-5DB-5
Column length (m) 25.25. 30.30.
Carrier gas    HeHe
Substrate
Column diameter (mm) 0.20.32 0.250.25
Phase thickness (μm) 0.330.52 0.250.25
Tstart (C) 100.35.35.40.40.
Tend (C) 180.320.300.310.310.
Heat rate (K/min) 5.15.8.2.4.
Initial hold (min)
Final hold (min)  10.
I 2474.42442.662442.52434.22472.3
ReferenceZhang, Shen, et al., 2000Richmond and Pombo-Villar, 1997Gautzsch and Zinn, 1996Lai and Song, 1995Lai and Song, 1995
Comment MSDC-RI MSDC-RI MSDC-RI MSDC-RI MSDC-RI
Column type CapillaryCapillaryCapillaryCapillaryCapillary
Active phase DB-5DB-5DB-5SE-30SE-52
Column length (m) 30.30.30.17.517.5
Carrier gas HeHeHeHeHe
Substrate
Column diameter (mm) 0.250.250.250.210.21
Phase thickness (μm) 0.250.250.25
Tstart (C) 40.40.40.100.100.
Tend (C) 310.310.310.280.280.
Heat rate (K/min) 6.4.4.2.2.
Initial hold (min)   5.
Final hold (min)
I 2494.92412.32471.82463.12432.2
ReferenceLai and Song, 1995Lai and Song, 1995Lai and Song, 1995Pozhidaev, Berezkin, et al., 1988Pozhidaev, Berezkin, et al., 1988
Comment MSDC-RI MSDC-RI MSDC-RI MSDC-RI MSDC-RI
Column type CapillaryCapillaryCapillaryCapillaryCapillary
Active phase SE-30SE-30SE-52SE-52SE-52
Column length (m) 25.25.33.316.616.6
Carrier gas N2N2HeHeHe
Substrate
Column diameter (mm) 0.330.330.500.500.50
Phase thickness (μm)
Tstart (C) 100.140.50.50.50.
Tend (C) 320.320.320.320.320.
Heat rate (K/min) 10.6.6.6.6.
Initial hold (min)   5.5.5.
Final hold (min)
I 2465.2454.2400.2400.2400.
ReferenceKorhonen and Lind, 1985Korhonen and Lind, 1985Beernaert, 1979Beernaert, 1979Beernaert, 1979
Comment MSDC-RI MSDC-RI MSDC-RI MSDC-RI MSDC-RI
Column type CapillaryCapillaryCapillaryCapillaryCapillary
Active phase SE-52SE-52SE-52SE-52SE-52
Column length (m) 16.616.616.616.616.6
Carrier gas HeHeHeHeHe
Substrate
Column diameter (mm) 0.500.500.500.500.50
Phase thickness (μm)
Tstart (C) 50.50.50.50.50.
Tend (C) 320.320.320.320.320.
Heat rate (K/min) 6.6.6.6.6.
Initial hold (min) 5.5.5.5.5.
Final hold (min)
I 2400.2400.2413.2413.2413.
ReferenceBeernaert, 1979Beernaert, 1979Beernaert, 1979Beernaert, 1979Beernaert, 1979
Comment MSDC-RI MSDC-RI MSDC-RI MSDC-RI MSDC-RI
Column type CapillaryCapillaryCapillaryCapillaryCapillary
Active phase SE-52SE-52SE-52SE-52SE-52
Column length (m) 16.616.616.616.616.6
Carrier gas HeHeHeHeHe
Substrate
Column diameter (mm) 0.500.500.500.500.50
Phase thickness (μm)
Tstart (C) 50.50.50.50.50.
Tend (C) 320.320.320.320.320.
Heat rate (K/min) 6.6.6.6.6.
Initial hold (min) 5.5.5.5.5.
Final hold (min)
I 2413.2422.2422.2424.2431.
ReferenceBeernaert, 1979Beernaert, 1979Beernaert, 1979Beernaert, 1979Beernaert, 1979
Comment MSDC-RI MSDC-RI MSDC-RI MSDC-RI MSDC-RI
Column type CapillaryCapillaryCapillary
Active phase SE-52SE-52SE-52
Column length (m) 16.616.650.
Carrier gas HeHeN2
Substrate
Column diameter (mm) 0.500.50
Phase thickness (μm)
Tstart (C) 50.50.100.
Tend (C) 320.320.300.
Heat rate (K/min) 6.6.2.5
Initial hold (min) 5.5.
Final hold (min)
I 2434.2437.2397.
ReferenceBeernaert, 1979Beernaert, 1979Cantuti, Cartoni, et al., 1965
Comment MSDC-RI MSDC-RI MSDC-RI

References

Roux, Temprado, et al., 2008
Roux, M.V.; Temprado, M.; Chickos, J.S.; Nagano, Y.,
Critically Evaluated Thermochemical Properties of Polycyclic Aromatic Hydrocarbons,
J. Phys. Chem. Ref. Data, 2008, 37, 4, 1855-1996. [all data]
Dorofeeva O.V., 1988
Dorofeeva O.V.,
Thermodynamic Properties of Polycyclic Aromatic Hydrocarbons in the Gaseous Phase. Institute for High Temperatures, USSR Academy of Sciences, Preprint No.1-238 (in Russian), Moscow, 1988. [all data]
Dorofeeva O.V., 1986
Dorofeeva O.V.,
On calculation of thermodynamic properties of polycyclic aromatic hydrocarbons,
Thermochim. Acta, 1986, 102, 59-66. [all data]
Moiseeva N.F., 1989
Moiseeva N.F.,
Development of Benson group additivity method for estimation of ideal gas thermodynamic properties of polycyclic aromatic hydrocarbons,
Thermochim. Acta, 1989, 153, 77-85. [all data]
Frenkel M., 1994
Frenkel M.,
Thermodynamics of Organic Compounds in the Gas State, Vol. I, II, Thermodynamics Research Center, College Station, Texas, 1994, 1994. [all data]
Magnus, Hartmann, et al., 1951
Magnus, A.; Hartmann, H.; Becker, F.,
Verbrennungswarmen und resonanzenergien von mehrkernigen aromatischen kohlenwasserstoffen,
Z. Phys. Chem., 1951, 197, 75-91. [all data]
Cox and Pilcher, 1970
Cox, J.D.; Pilcher, G.,
Thermochemistry of Organic and Organometallic Compounds, Academic Press, New York, 1970, 1-636. [all data]
Weast and Grasselli, 1989
CRC Handbook of Data on Organic Compounds, 2nd Editon, Weast,R.C and Grasselli, J.G., ed(s)., CRC Press, Inc., Boca Raton, FL, 1989, 1. [all data]
Casellato, Vecchi, et al., 1973
Casellato, F.; Vecchi, C.; Girell, A.,
Differential calorimetric study of polycyclic aromatic hydrocarbons,
Thermochim. Acta, 1973, 6, 4, 361, https://doi.org/10.1016/0040-6031(73)87003-0
. [all data]
Sangster and Irvine, 1956
Sangster, R.C.; Irvine, J.W.,
Study of Organic Scintillators,
J. Chem. Phys., 1956, 24, 670. [all data]
Schuyer, Blom, et al., 1953
Schuyer, J.; Blom, L.; Van Krevelen, D.W.,
Molar refraction of condensed aromatic compounds.,
Trans. Faraday Soc., 1953, 49, 1391. [all data]
Jones and Neuworth, 1944
Jones, R.C.; Neuworth, M.B.,
The Ultraviolet Absorption Spectra of Hydrocarbon-Trinitrobenzene Complexes,
J. Am. Chem. Soc., 1944, 66, 1497. [all data]
Baxter and Hale, 1936
Baxter, G.P.; Hale, A.H.,
A Revision of the Atomic Weight of Carbon,
J. Am. Chem. Soc., 1936, 58, 510. [all data]
Zhao, Unhannanant, et al., 2008
Zhao, Hui; Unhannanant, Patamaporn; Hanshaw, William; Chickos, James S.,
Enthalpies of Vaporization and Vapor Pressures of Some Deuterated Hydrocarbons. Liquid-Vapor Pressure Isotope Effects,
J. Chem. Eng. Data, 2008, 53, 7, 1545-1556, https://doi.org/10.1021/je800091s
. [all data]
Haftka, Parsons, et al., 2006
Haftka, Joris J.H.; Parsons, John R.; Govers, Harrie A.J.,
Supercooled liquid vapour pressures and related thermodynamic properties of polycyclic aromatic hydrocarbons determined by gas chromatography,
Journal of Chromatography A, 2006, 1135, 1, 91-100, https://doi.org/10.1016/j.chroma.2006.09.050
. [all data]
Kruif, 1980
Kruif, C.G.,
Enthalpies of sublimation and vapour pressures of 11 polycyclic hydrocarbons,
J. Chem. Thermodyn., 1980, 12, 243-248. [all data]
Lei, Chankalal, et al., 2002
Lei, Ying Duan; Chankalal, Raymond; Chan, Anita; Wania, Frank,
Supercooled Liquid Vapor Pressures of the Polycyclic Aromatic Hydrocarbons,
J. Chem. Eng. Data, 2002, 47, 4, 801-806, https://doi.org/10.1021/je0155148
. [all data]
Nass, Lenoir, et al., 1995
Nass, Karen; Lenoir, Dieter; Kettrup, Antonius,
Calculation of the Thermodynamic Properties of Polycyclic Aromatic Hydrocarbons by an Incremental Procedure,
Angew. Chem. Int. Ed. Engl., 1995, 34, 16, 1735-1736, https://doi.org/10.1002/anie.199517351
. [all data]
Wakayama and Inokuchi, 1967
Wakayama, Nobuko; Inokuchi, Hiroo,
Heats of Sublimation of Polycyclic Aromatic Hydrocarbons and Their Molecular Packings,
Bull. Chem. Soc. Jpn., 1967, 40, 10, 2267-2271, https://doi.org/10.1246/bcsj.40.2267
. [all data]
Cox and Pilcher, 1970, 2
Cox, J.D.; Pilcher, G.,
Thermochemistry of Organic and Organometallic Compounds, Academic Press Inc., London, 1970, 643. [all data]
Hoyer and Peperle, 1958
Hoyer, H.; Peperle, W.,
Z. Elektrochem., 1958, 62, 61. [all data]
Hoyer and Peperle, 1958, 2
Hoyer, H.; Peperle, W.,
Dampfdrunkmessungen an organischen substanzen und ihre sublimationswarmen,
Z. Electrochem., 1958, 62, 61-66. [all data]
Kestens, Auclair, et al., 2010
Kestens, Vikram; Auclair, Guy; Drozdzewska, Katarzyna; Held, Andrea; Roebben, Gert; Linsinger, Thomas,
Thermodynamic property values of selected polycyclic aromatic hydrocarbons measured by differential scanning calorimetry,
J Therm Anal Calorim, 2010, 99, 1, 245-261, https://doi.org/10.1007/s10973-009-0440-6
. [all data]
Casellato, Vecchi, et al., 1973, 2
Casellato, F.; Vecchi, C.; Girelli, A.; Casu, B.,
Differential calorimetric study of polycyclic aromatic hydrocarbons,
Thermochimica Acta, 1973, 6, 4, 361-368, https://doi.org/10.1016/0040-6031(73)87003-0
. [all data]
Meot-Ner (Mautner), 1980
Meot-Ner (Mautner), M.,
Dimer Cations of Polycyclic Aromatics: Experimental Bonding Energies and Resonance Stabilization,
J. Phys. Chem., 1980, 84, 21, 2724, https://doi.org/10.1021/j100458a012
. [all data]
Hunter and Lias, 1998
Hunter, E.P.; Lias, S.G.,
Evaluated Gas Phase Basicities and Proton Affinities of Molecules: An Update,
J. Phys. Chem. Ref. Data, 1998, 27, 3, 413-656, https://doi.org/10.1063/1.556018
. [all data]
Tschurl and Boesl, 2006
Tschurl, M.; Boesl, U.,
Photodetachment-photoelectron spectroscopy of jet-cooled chrysene,
Int. J. Mass Spectrom., 2006, 249, 364-369, https://doi.org/10.1016/j.ijms.2005.11.024
. [all data]
Becker and Chen, 1966
Becker, R.S.; Chen, E.,
Extension of Electron Affinities and Ionization Potentials of Aromatic Hydrocarbons,
J. Chem. Phys., 1966, 45, 7, 2403, https://doi.org/10.1063/1.1727954
. [all data]
Wentworth and Becker, 1962
Wentworth, W.E.; Becker, R.S.,
Potential Method for the Determination of Electron Affinities of Molecules: Application to Some Aromatic Hydrocarbons.,
J. Am. Chem. Soc., 1962, 84, 22, 4263, https://doi.org/10.1021/ja00881a014
. [all data]
Aue, Guidoni, et al., 2000
Aue, D.H.; Guidoni, M.; Betowski, L.D.,
Ab initio calculated gas-phase basicities of polynuclear aromatic hydrocarbons,
Int. J. Mass Spectrom., 2000, 201, 283. [all data]
Shahbaz, Akiyama, et al., 1981
Shahbaz, M.; Akiyama, I.; LeBreton, P.,
Ultraviolet photoelectron studies of methyl substituted chrysenes,
Biochem. Biophys. Res. Commun., 1981, 103, 25. [all data]
Shushan and Boyd, 1980
Shushan, B.; Boyd, R.K.,
Unimolecular and collision induced fragmentations of molecular ions of polycyclic aromatic hydrocarbons,
Org. Mass Spectrom., 1980, 15, 445. [all data]
Mautner(Meot-Ner), 1980
Mautner(Meot-Ner), M.,
Ion thermochemistry of low volatility compounds in the gas phase. 3. Polycyclic aromatics: Ionization energies, proton, and hydrogen affinities. Extrapolations to graphite,
J. Phys. Chem., 1980, 84, 2716. [all data]
Boschi, Murrell, et al., 1972
Boschi, R.; Murrell, J.N.; Schmidt, W.,
Photoelectron spectra of polycyclic aromatic hydrocarbons,
Faraday Discuss. Chem. Soc., 1972, 54, 116. [all data]
Wacks, 1964
Wacks, M.E.,
Electron-impact studies of aromatic hydrocarbons. II. Naphthacene, naphthaphene, chrysene, triphenylene, and pyrene,
J. Chem. Phys., 1964, 41, 1661. [all data]
Kuroda, 1964
Kuroda, H.,
Ionization potentials of polycyclic aromatic hydrocarbons,
Nature, 1964, 201, 1214. [all data]
Briegleb, 1964
Briegleb, G.,
Electron affinity of organic molecules,
Angew. Chem. Intern. Ed., 1964, 3, 617. [all data]
Kinoshita, 1962
Kinoshita, M.,
The absorption spectra of the molecular complexes of aromatic compounds with p-bromanil,
Bull. Chem. Soc. Japan, 1962, 35, 1609. [all data]
Briegleb, Czekalla, et al., 1961
Briegleb, G.; Czekalla, J.; Reuss, G.,
Mesomeriemomente und Elektronenuberfuhrungsbanden von Elektronen-donator-akzeptor-komplexen des Chloranils und Tetracyanathylens mit aromatischen Kohlenwasserstoffen,
Z. Phys. Chem. (Neue Folge), 1961, 30, 333. [all data]
Birks and Stifkin, 1961
Birks, J.B.; Stifkin, M.A.,
π-Electronic excitation and ionization energies of condensed ring aromatic hydrocarbons,
Nature, 1961, 191, 761. [all data]
Briegleb and Czekalla, 1959
Briegleb, G.; Czekalla, J.,
Die Bestimmung von lonisierungsenergien aus den Spektren von Elektronenubergangskomplexen,
Z.Elektrochem., 1959, 63, 6. [all data]
Matsen, 1956
Matsen, F.A.,
Electron affinities, methyl affinities, and ionization energies of condensed ring aromatic hydrocarbons,
J. Chem. Phys., 1956, 24, 602. [all data]
Schmidt, 1977
Schmidt, W.,
Photoelectron spectra of polynuclear aromatics. V. Correlations with ultraviolet absorption spectra in the catacondensed series,
J. Chem. Phys., 1977, 66, 828. [all data]
Clar and Schmidt, 1976
Clar, E.; Schmidt, W.,
Correlations between photoelectron and phosphorescence spectra of polycyclic hydrocarbons,
Tetrahedron, 1976, 32, 2563. [all data]
Brogli and Heilbronner, 1972
Brogli, F.; Heilbronner, E.,
The photoelectron spectra of benzenoid hydrocarbons C18H12,
Angew. Chem. Int. Ed. Engl., 1972, 11, 538. [all data]