Selenium cyanide
- Formula: C2N2Se
- Molecular weight: 130.99
- IUPAC Standard InChIKey: NRUPVVPBPCPMPJ-UHFFFAOYSA-N
- CAS Registry Number: 2180-01-0
- Chemical structure:
View 3d structure (requires JavaScript / HTML 5) - Permanent link for this species. Use this link for bookmarking this species for future reference.

Gas phase ion energetics data

Data compiled by: Sharon G. Lias, Rhoda D. Levin, and Sherif A. Kafafi
Ionization energy determinations
IE (eV) | Method | Reference |
---|---|---|
10.96 ± 0.02 | PE | Jonkers, Mooyman, et al., 1981 |

References

Jonkers, Mooyman, et al., 1981
Jonkers, G.; Mooyman, R.; De Lange, C.A.,
Ultraviolet photoelectron spectroscopy of unstable species: Nitrosyl cyanide (ONCN),
Chem. Phys., 1981, 57, 97. [all data]