1,2-Diethynylbenzene
- Formula: C10H6
- Molecular weight: 126.1546
- IUPAC Standard InChIKey: CBYDUPRWILCUIC-UHFFFAOYSA-N
- CAS Registry Number: 21792-52-9
- Chemical structure:
View 3d structure (requires JavaScript / HTML 5) - Permanent link for this species. Use this link for bookmarking this species for future reference.

Gas phase ion energetics data

Data compiled as indicated in comments:
LLK - Sharon G. Lias, Rhoda D. Levin, and Sherif A. Kafafi
Ionization energy determinations
IE (eV) | Method | Reference | Comment |
---|---|---|---|
8.69 ± 0.02 | PE | Brogli, Heilbronner, et al., 1975 | LLK |

References

Brogli, Heilbronner, et al., 1975
Brogli, F.; Heilbronner, E.; Wirz, J.; Kloster-Jensen, E.; Bergman, R.G.; Vollhardt, K.P.C.; Ashe, A.J., III,
The consequences of σ and π conjugative interactions in mono-, di- and triacetylenes. A photoelectron spectroscopic investigation,
Helv. Chim. Acta, 1975, 58, 2620. [all data]