1,3-Cyclopentadiene, 5-(1-methylethylidene)-
- Formula: C8H10
- Molecular weight: 106.1650
- IUPAC Standard InChIKey: WXACXMWYHXOSIX-UHFFFAOYSA-N
- CAS Registry Number: 2175-91-9
- Chemical structure:
View 3d structure (requires JavaScript / HTML 5) - Other names: 1,3-Cyclopentadiene, 5-isopropylidene-; Dimethylfulvene; Isopropylidenecyclopentadiene; 5-Isopropylidene-1,3-cyclopentadiene; 6,6-Dimethylfulvene; 5-(1-Methylethylidene)-1,3-cyclopentadiene; 5-Isopropylidenecyclopentadiene; Fulvene, 6,6-dimethyl

Gas phase thermochemistry data

Data compiled by: Hussein Y. Afeefy, Joel F. Liebman, and Stephen E. Stein
Quantity | Value | Units | Method | Reference | Comment |
---|---|---|---|---|---|
ΔfH°gas | 144. | kJ/mol | Chyd | Roth, Adamczak, et al., 1991 |

Condensed phase thermochemistry data

Data compiled by: Hussein Y. Afeefy, Joel F. Liebman, and Stephen E. Stein
Quantity | Value | Units | Method | Reference | Comment |
---|---|---|---|---|---|
ΔcH°liquid | -4667.3 ± 5.0 | kJ/mol | Ccb | Day and Oestreich, 1957 | Reanalyzed by Cox and Pilcher, 1970, Original value = -4663.1 kJ/mol; Corresponding ΔfHºliquid = 90.04 kJ/mol (simple calculation by NIST; no Washburn corrections) |

Phase change data

Data compiled as indicated in comments:
BS - Robert L. Brown and Stephen E. Stein
TRC - Thermodynamics Research Center, NIST Boulder Laboratories, Chris Muzny director
ALS - Hussein Y. Afeefy, Joel F. Liebman, and Stephen E. Stein
Quantity | Value | Units | Method | Reference | Comment |
---|---|---|---|---|---|
Tfus | 274.05 | K | N/A | Murphy and Duggan, 1949 | Uncertainty assigned by TRC = 2. K; TRC |
Quantity | Value | Units | Method | Reference | Comment |
ΔvapH° | 44.18 | kJ/mol | V | Day and Oestreich, 1957 | ALS |
Reduced pressure boiling point
Tboil (K) | Pressure (bar) | Reference | Comment |
---|---|---|---|
349.7 | 0.067 | Aldrich Chemical Company Inc., 1990 | BS |
332. to 333. | 0.033 | Frinton Laboratories Inc., 1986 | BS |

Reaction thermochemistry data

Data compiled as indicated in comments:
B - John E. Bartmess
ALS - Hussein Y. Afeefy, Joel F. Liebman, and Stephen E. Stein
Individual Reactions
C8H9- + =
By formula: C8H9- + H+ = C8H10
Quantity | Value | Units | Method | Reference | Comment |
---|---|---|---|---|---|
ΔrH° | 1482. ± 13. | kJ/mol | G+TS | Brickhouse and Squires, 1988 | gas phase; Acidity between nPrSH, iPrSH; B |
Quantity | Value | Units | Method | Reference | Comment |
ΔrG° | 1454. ± 13. | kJ/mol | IMRB | Brickhouse and Squires, 1988 | gas phase; Acidity between nPrSH, iPrSH; B |
By formula: 3H2 + C8H10 = C8H16
Quantity | Value | Units | Method | Reference | Comment |
---|---|---|---|---|---|
ΔrH° | -302. ± 0.4 | kJ/mol | Chyd | Roth, Adamczak, et al., 1991 | liquid phase; ALS |

Gas phase ion energetics data

Data compiled as indicated in comments:
B - John E. Bartmess
LLK - Sharon G. Lias, Rhoda D. Levin, and Sherif A. Kafafi
Ionization energy determinations
IE (eV) | Method | Reference | Comment |
---|---|---|---|
8.03 | PE | Houk, George, et al., 1974 | Vertical value; LLK |
De-protonation reactions
C8H9- + =
By formula: C8H9- + H+ = C8H10
Quantity | Value | Units | Method | Reference | Comment |
---|---|---|---|---|---|
ΔrH° | 1482. ± 13. | kJ/mol | G+TS | Brickhouse and Squires, 1988 | gas phase; Acidity between nPrSH, iPrSH; B |
Quantity | Value | Units | Method | Reference | Comment |
ΔrG° | 1454. ± 13. | kJ/mol | IMRB | Brickhouse and Squires, 1988 | gas phase; Acidity between nPrSH, iPrSH; B |

Van Den Dool and Kratz RI, non-polar column, temperature ramp

Column type | Active phase | I | Reference | Comment |
---|---|---|---|---|
Capillary | DB-5 | 858. | Wu, Zorn, et al., 2005 | 30. m/0.32 mm/0.25 μm, He, 40. C @ 2. min, 5. K/min, 250. C @ 5. min |

Van Den Dool and Kratz RI, polar column, temperature ramp

Column type | Active phase | I | Reference | Comment |
---|---|---|---|---|
Capillary | ZB-Wax | 1170. | Wu, Zorn, et al., 2005 | 30. m/0.32 mm/0.25 μm, He, 40. C @ 2. min, 5. K/min, 250. C @ 5. min |

References

Roth, Adamczak, et al., 1991
Roth, W.R.; Adamczak, O.; Breuckmann, R.; Lennartz, H.-W.; Boese, R.,
Die Berechnung von Resonanzenergien; das MM2ERW-Kraftfeld,
Chem. Ber., 1991, 124, 2499-2521. [all data]
Day and Oestreich, 1957
Day, J.H.; Oestreich, C.,
Fulvenes: III. Heat of combustion and resonance energy,
J. Org. Chem., 1957, 22, 214-216. [all data]
Cox and Pilcher, 1970
Cox, J.D.; Pilcher, G.,
Thermochemistry of Organic and Organometallic Compounds, Academic Press, New York, 1970, 1-636. [all data]
Murphy and Duggan, 1949
Murphy, M.T.; Duggan, A.C.,
Pyrolysis of Butadiene,
J. Am. Chem. Soc., 1949, 71, 3347. [all data]
Aldrich Chemical Company Inc., 1990
Aldrich Chemical Company Inc.,
Catalog Handbook of Fine Chemicals, Aldrich Chemical Company, Inc., Milwaukee WI, 1990, 1. [all data]
Frinton Laboratories Inc., 1986
Frinton Laboratories Inc.,
Catalog Number 11, Frinton Laboratories Inc., Vineland, NJ, 1986, 99. [all data]
Brickhouse and Squires, 1988
Brickhouse, M.D.; Squires, R.R.,
Gas Phase Bronsted vs. Lewis Acid-Base Reactions of 6,6-Dimethylfulvene. A Sensitive Probe of the Electronic Structures of Organic Anions,
J. Am. Chem. Soc., 1988, 110, 9, 2706, https://doi.org/10.1021/ja00217a002
. [all data]
Houk, George, et al., 1974
Houk, K.N.; George, J.K.; Duke, R.E., Jr.,
A frontier molecular orbital treatment of fulvene cycloadditions. Molecular orbital calculations and photoelectron spectra of substituted fulvenes,
Tetrahedron, 1974, 30, 523. [all data]
Wu, Zorn, et al., 2005
Wu, S.; Zorn, H.; Krings, U.; Berger, R.G.,
Characteristic Volatiles from Young and Aged Fruiting Bodies of Wild Polyporus sulfureus (Bull.:Fr.) Fr.,
J. Agric. Food Chem., 2005, 53, 11, 4524-4528, https://doi.org/10.1021/jf0478511
. [all data]