1,3-Bis(trimethylsilyl)propyne
- Formula: C9H20Si2
- Molecular weight: 184.4261
- IUPAC Standard InChIKey: DUPUXONPNLEQPD-UHFFFAOYSA-N
- CAS Registry Number: 21752-80-7
- Chemical structure:
View 3d structure (requires JavaScript / HTML 5) - Permanent link for this species. Use this link for bookmarking this species for future reference.

Gas phase ion energetics data

Data compiled by: Henry M. Rosenstock, Keith Draxl, Bruce W. Steiner, and John T. Herron
Ionization energy determinations
IE (eV) | Method | Reference |
---|---|---|
8.95 ± 0.04 | EI | Bock and Seidl, 1968 |

References

Bock and Seidl, 1968
Bock, H.; Seidl, H.,
d-Orbital effects in siliconsubstituted π-electron systems. Part XII. Some spectroscopic properties of alkyl and silyl acetylenes and polyacetylenes,
J. Chem. Soc. B, 1968, 1158. [all data]