2-Azabicyclo[2.2.2]octane,2-nitroso

Gas phase ion energetics data

Data compiled by: Sharon G. Lias, Rhoda D. Levin, and Sherif A. Kafafi

Ionization energy determinations

IE (eV) Method Reference Comment
8.72PEBattiste, Davis, et al., 1975Vertical value

References

Battiste, Davis, et al., 1975
Battiste, D.R.; Davis, L.P.; Nauman, R.V., Photoelectron spectroscopy and quantum chemical analysis of some «N»-nitrosamines, J. Am. Chem. Soc., 1975, 97, 5071. [all data]