Cobalt tris(acetylacetonate)
- Formula: C15H21CoO6
- Molecular weight: 356.2568
- IUPAC Standard InChIKey: RHCQEPWEBDOALW-LNTINUHCSA-K
- CAS Registry Number: 21679-46-9
- Chemical structure:
View 3d structure (requires JavaScript / HTML 5) - Other names: Cobalt acetylacetonate; Cobalt, tris(2,4-pentanedionato-O,O')-, (OC-6-11)-; Cobalt, tris(2,4-pentanedionato)-; Cobalt triacetoacetate; Cobalt triacetylacetonate; Cobalt(III) acetylacetonate; Cobalt(3+) acetylacetonate; Cobaltic acetylacetonate; Cobaltic trisacetylacetonate; Tris(acetylacetonato)cobalt; Tris(2,4-pentanedionato)cobalt; Cobalt(III) 2,4-pentanedionate; Tris(acetylacetonato)cobalt(III); Cobalt, tris(2,4-pentanedionato-O,O')-; Cobalt, tris(2,4-pentanedionato-κO,κO')-, (OC-6-11)-; Cobalt, tris(2,4-pentanedionato-κO2,κO4)-, (OC-6-11)-; NSC 43621; Tris(acetylacetone)cobalt; tris(pentane-2,4-dionato-O,O')cobalt

Phase change data

Data compiled by: William E. Acree, Jr., James S. Chickos
Quantity | Value | Units | Method | Reference | Comment |
---|---|---|---|---|---|
ΔsubH° | 134.6 ± 4.0 | kJ/mol | ME | Malkerova, Alikhanyan, et al., 1990 | Based on data from 318. to 382. K. |
Enthalpy of sublimation
ΔsubH (kJ/mol) | Temperature (K) | Method | Reference |
---|---|---|---|
138. | 433. to 463. | TGA | Fahlman and Barron, 2000 |
142.6 ± 6.9 | 471. | DSC | Murray and Hill, 1987 |
107.1 | 390. | N/A | Götze, Bloss, et al., 1970 |
Enthalpy of fusion
ΔfusH (kJ/mol) | Temperature (K) | Method | Reference | Comment |
---|---|---|---|---|
93.9 | 478. | DSC | Sabolovic, Mrak, et al., 2004 | Value is abnormally large compared with Cr(acac)<sub>3</sub>- may undergo decomposition |

Gas phase ion energetics data

Data compiled as indicated in comments:
LLK - Sharon G. Lias, Rhoda D. Levin, and Sherif A. Kafafi
RDSH - Henry M. Rosenstock, Keith Draxl, Bruce W. Steiner, and John T. Herron
B - John E. Bartmess
Electron affinity determinations
EA (eV) | Method | Reference | Comment |
---|---|---|---|
2.038 ± 0.087 | IMRB | Sharpe, Eyler, et al., 1990 | EA given is actually -ΔGea(350 K). Between 2-Ph-quinone, 3-CN-1,3-diNO2benzene; B |
Ionization energy determinations
IE (eV) | Method | Reference | Comment |
---|---|---|---|
7.56 ± 0.05 | EI | Westmore, Reimer, et al., 1981 | LLK |
7.1 ± 0.2 | PE | Westmore, Reimer, et al., 1981 | LLK |
10.7 ± 0.3 | EI | Bancroft, Reichert, et al., 1968 | RDSH |
7.80 ± 0.05 | EI | Bancroft, Reichert, et al., 1968 | RDSH |
7.52 | PE | Brittain, Horozoglu, et al., 1979 | Vertical value; LLK |
7.52 ± 0.07 | PE | Evans, Hamnett, et al., 1972 | Vertical value; LLK |

References

Malkerova, Alikhanyan, et al., 1990
Malkerova, I.P.; Alikhanyan, A.S.; Sevast'yanov, V.G.; Grinberg, Ya.Kh.; Gorgoraki, V.I.,
Thermal behavior of 3d transition metal acetylacetonates,
Zh. Neorg. Khim., 1990, 35, 2, 413. [all data]
Fahlman and Barron, 2000
Fahlman, Bradley D.; Barron, Andrew R.,
Substituent effects on the volatility of metal ?-diketonates,
Adv. Mater. Opt. Electron., 2000, 10, 3-5, 223-232, https://doi.org/10.1002/1099-0712(200005/10)10:3/5<223::AID-AMO411>3.0.CO;2-M
. [all data]
Murray and Hill, 1987
Murray, J.P.; Hill, J.O.,
DSC determination of the sublimation enthalpy of tris(2,4-pentanedionato)cobalt(III) and bis(2,4-pentanedionato) nickel(II) and -copper(II),
Thermochimica Acta, 1987, 109, 2, 383-390, https://doi.org/10.1016/0040-6031(87)80034-5
. [all data]
Götze, Bloss, et al., 1970
Götze, H.-J.; Bloss, K.; Molketin, H.,
Dampfdruckbestimmung von Acetylacetonaten,
Zeitschrift für Physikalische Chemie, 1970, 73, 46, 314-320, https://doi.org/10.1524/zpch.1970.73.46.314
. [all data]
Sabolovic, Mrak, et al., 2004
Sabolovic, Jasmina; Mrak, Zeljko; Kostrun, Sanja; Janekovic, August,
Is the Enthalpy of Fusion of Tris(acetylacetonato)metal(III) Complexes Affected by Their Potential Energy in the Crystal State?,
Inorg. Chem., 2004, 43, 26, 8479-8489, https://doi.org/10.1021/ic048900u
. [all data]
Sharpe, Eyler, et al., 1990
Sharpe, P.; Eyler, J.R.; Richardson, D.E.,
Free Energies of Electron Attachment to Tris(acetylacetonate) and Tris(hexafluoroacetylacetonate) Transition-Metal Complexes in the Gas Phase: Experimental Results and Ligand Field Analysis,
Inorg. Chem., 1990, 29, 15, 2779, https://doi.org/10.1021/ic00340a014
. [all data]
Westmore, Reimer, et al., 1981
Westmore, J.B.; Reimer, M.L.J.; Reichert, C.,
Ionization energies of metal chelates. Acetylacetonates, trifluoroacetylacetonates, and hexafluoroacetylacetonates of trivalent metals of the first transition series,
Can. J. Chem., 1981, 59, 1797. [all data]
Bancroft, Reichert, et al., 1968
Bancroft, G.M.; Reichert, C.; Westmore, J.B.,
Mass spectral studies of metal chelates. II. Mass spectra and appearance potentials of acetylacetonates of trivalent metals of the first transition series,
Inorg. Chem., 1968, 7, 870. [all data]
Brittain, Horozoglu, et al., 1979
Brittain, H.G.; Horozoglu, G.; Baker, A.D.,
The He(I) photoelectron spectra of some γ-substituted Co(III) acetylacetonate complexes,
J. Electron Spectrosc. Relat. Phenom., 1979, 16, 107. [all data]
Evans, Hamnett, et al., 1972
Evans, S.; Hamnett, A.; Orchard, A.F.; Lloyd, D.R.,
Study of the metal-oxygen bond in simple tris-chelate complexes by He(I) photoelectron spectroscopy,
Faraday Discuss. Chem. Soc., 1972, 54, 227. [all data]