2-Butenedinitrile, 2,3-bis(trifluoromethyl)-, (E)-
- Formula: C6F6N2
- Molecular weight: 214.0680
- IUPAC Standard InChIKey: UDDGYNNPOKTCHY-ONEGZZNKSA-N
- CAS Registry Number: 2167-31-9
- Chemical structure:
View 3d structure (requires JavaScript / HTML 5) - Permanent link for this species. Use this link for bookmarking this species for future reference.

Gas phase ion energetics data

Data compiled by: Sharon G. Lias, Rhoda D. Levin, and Sherif A. Kafafi
Ionization energy determinations
IE (eV) | Method | Reference | Comment |
---|---|---|---|
11.85 ± 0.05 | PE | Houk and Munchausen, 1976 | Vertical value |

References

Houk and Munchausen, 1976
Houk, K.N.; Munchausen, L.L.,
Ionization potentials, electron affinities, reactivities of cyanoalkenes related electron-deficient alkenes. A frontier molecular orbital treatment of cyanoalkene reactivities in cycloaddition, electrophilic, nucleophilic, and radical reactions.,
J. Am. Chem. Soc., 1976, 98, 937. [all data]