Hexane-d14
- Formula: C6D14
- Molecular weight: 100.2616
- IUPAC Standard InChIKey: VLKZOEOYAKHREP-ZLKPZJALSA-N
- CAS Registry Number: 21666-38-6
- Chemical structure:
View 3d structure (requires JavaScript / HTML 5) - Isotopologues:

Gas phase ion energetics data

Data compiled by: Sharon G. Lias, Rhoda D. Levin, and Sherif A. Kafafi
Ionization energy determinations
IE (eV) | Method | Reference |
---|---|---|
10.18 | EQ | Lias, Ausloos, et al., 1976 |

Kovats' RI, non-polar column, isothermal

Column type | Active phase | Temperature (C) | I | Reference | Comment |
---|---|---|---|---|---|
Capillary | Apiezon L | 50. | 589. | Gäumann and Bonzo, 1973 | Column length: 100. m |

References

Lias, Ausloos, et al., 1976
Lias, S.G.; Ausloos, P.; Horvath, Z.,
Charge transfer reactions in alkane and cycloalkane systems. Estimated ionization potentials,
Int. J. Chem. Kinet., 1976, 8, 725. [all data]
Gäumann and Bonzo, 1973
Gäumann, T.; Bonzo, R.,
The gas-chromatographic retention indices of deuterated compounds,
Helv. Chim. Acta, 1973, 56, 3, 1165-1176, https://doi.org/10.1002/hlca.19730560340
. [all data]