Diazene, (4-methoxyphenyl)phenyl-, (E)-
- Formula: C13H12N2O
- Molecular weight: 212.2472
- IUPAC Standard InChIKey: LGCRPKOHRIXSEG-CCEZHUSRSA-N
- CAS Registry Number: 21650-49-7
- Chemical structure:
View 3d structure (requires JavaScript / HTML 5) - Stereoisomers:

Gas phase ion energetics data

Data compiled by: Sharon G. Lias, Rhoda D. Levin, and Sherif A. Kafafi
Ionization energy determinations
IE (eV) | Method | Reference | Comment |
---|---|---|---|
8.0 ± 0.05 | PE | Millefiori, Millefiori, et al., 1979 | Vertical value |

References

Millefiori, Millefiori, et al., 1979
Millefiori, S.; Millefiori, A.; Pignataro, S.; Distefano, G.; Colonna, F.P.,
Gas phase UPS investigation of trans-azobenzenes,
Z. Naturforsch. A:, 1979, 34, 1496. [all data]