Cycloheptanone, oxime
- Formula: C7H13NO
- Molecular weight: 127.1842
- IUPAC Standard InChIKey: OENGSNXUALAIFP-UHFFFAOYSA-N
- CAS Registry Number: 2158-31-8
- Chemical structure:
View 3d structure (requires JavaScript / HTML 5) - Permanent link for this species. Use this link for bookmarking this species for future reference.

Gas phase ion energetics data

Data compiled as indicated in comments:
LLK - Sharon G. Lias, Rhoda D. Levin, and Sherif A. Kafafi
Ionization energy determinations
IE (eV) | Method | Reference | Comment |
---|---|---|---|
8.88 ± 0.03 | PI | Golubitskii, Kulikov, et al., 1979 | LLK |
Appearance energy determinations
Ion | AE (eV) | Other Products | Method | Reference | Comment |
---|---|---|---|---|---|
C5H9NO+ | 9.76 ± 0.05 | C2H4 | PI | Golubitskii, Kulikov, et al., 1979 | LLK |
C7H11+ | 9.80 ± 0.05 | NHOH | PI | Golubitskii, Kulikov, et al., 1979 | LLK |
C7H12N+ | 9.97 ± 0.05 | OH | PI | Golubitskii, Kulikov, et al., 1979 | LLK |

References

Golubitskii, Kulikov, et al., 1979
Golubitskii, A.E.; Kulikov, N.S.; Zyakun, A.M.; Valovoi, V.A.; Alekseev, A.M.; Volkov, V.N.,
Photoionization mass spectra of alicyclic compounds with various substituents, and their ionization energies and appearance energies,
Bull. Acad. Sci. USSR, Div. Chem. Sci., 1979, 11, 2602. [all data]