Piperidine, 1-chloro-
- Formula: C5H10ClN
- Molecular weight: 119.593
- IUPAC Standard InChIKey: CIQJWKNJDQKPPO-UHFFFAOYSA-N
- CAS Registry Number: 2156-71-0
- Chemical structure:
View 3d structure (requires JavaScript / HTML 5) - Permanent link for this species. Use this link for bookmarking this species for future reference.

Gas phase ion energetics data

Data compiled as indicated in comments:
LLK - Sharon G. Lias, Rhoda D. Levin, and Sherif A. Kafafi
Ionization energy determinations
IE (eV) | Method | Reference | Comment |
---|---|---|---|
8.5 | PE | Gan and Peel, 1979 | LLK |
9.00 ± 0.10 | PE | Gan and Peel, 1979 | Vertical value; LLK |

References

Gan and Peel, 1979
Gan, T.-H.; Peel, J.B.,
Photoelectron spectroscopic studies of piperidine and its N-halo derivatives,
Aust. J. Chem., 1979, 32, 475. [all data]