Benzamide, 4-(dimethylamino)-N,N-dimethyl-
- Formula: C11H16N2O
- Molecular weight: 192.2575
- IUPAC Standard InChIKey: SWIMPUZQSVMCCL-UHFFFAOYSA-N
- CAS Registry Number: 21566-11-0
- Chemical structure:
View 3d structure (requires JavaScript / HTML 5) - Permanent link for this species. Use this link for bookmarking this species for future reference.

Gas phase ion energetics data

Data compiled by: Sharon G. Lias, John E. Bartmess, Joel F. Liebman, John L. Holmes, Rhoda D. Levin, and W. Gary Mallard
Ionization energy determinations
IE (eV) | Method | Reference | Comment |
---|---|---|---|
7.40 | PE | Gal, Geribaldi, et al., 1985 | Vertical value |

References

Gal, Geribaldi, et al., 1985
Gal, J.-F.; Geribaldi, S.; Pfister-Guillouzo, G.; Morris, D.G.,
Basicity of the carbonyl group. Part 12. Correlations between ionization potentials and lewis basicities in aromatic carbonyl compounds,
J. Chem. Soc. Perkin Trans. 2, 1985, 103. [all data]