N-Allyl-N,N-dimethylamine
- Formula: C5H11N
- Molecular weight: 85.1475
- IUPAC Standard InChIKey: GBCKRQRXNXQQPW-UHFFFAOYSA-N
- CAS Registry Number: 2155-94-4
- Chemical structure:
View 3d structure (requires JavaScript / HTML 5) - Other names: CH2=CHCH2N(CH3)2; N,N-Dimethylallylamine; Allyldimethylamine; N-Allyldimethylamine; 2-Propen-1-amine, N,N-dimethyl-; Allylamine, N,N-dimethyl-; Dimethylallylamine; N,N-Dimethyl-2-propene-1-amine

Phase change data

Data compiled as indicated in comments:
BS - Robert L. Brown and Stephen E. Stein
TRC - Thermodynamics Research Center, NIST Boulder Laboratories, Chris Muzny director
Quantity | Value | Units | Method | Reference | Comment |
---|---|---|---|---|---|
Tboil | 336.7 | K | N/A | Weast and Grasselli, 1989 | BS |
Tboil | 335.15 | K | N/A | Katritzky, Pinzelli, et al., 1970 | Uncertainty assigned by TRC = 2. K; TRC |

Reaction thermochemistry data

Data compiled as indicated in comments:
B - John E. Bartmess
ALS - Hussein Y. Afeefy, Joel F. Liebman, and Stephen E. Stein
Individual Reactions
C5H10N- + =
By formula: C5H10N- + H+ = C5H11N
Quantity | Value | Units | Method | Reference | Comment |
---|---|---|---|---|---|
ΔrH° | 1626. ± 17. | kJ/mol | G+TS | Dahlke and Kass, 1991 | gas phase; Between H2O, furan. Reprotonation site uncertain; B |
Quantity | Value | Units | Method | Reference | Comment |
ΔrG° | 1598. ± 17. | kJ/mol | IMRB | Dahlke and Kass, 1991 | gas phase; Between H2O, furan. Reprotonation site uncertain; B |
By formula: C3H5Cl + 2C2H7N = C5H11N + C2H8ClN
Quantity | Value | Units | Method | Reference | Comment |
---|---|---|---|---|---|
ΔrH° | -82.6 ± 0.4 | kJ/mol | Cm | Beldie, Aelenei, et al., 1982 | liquid phase; ALS |

Gas phase ion energetics data

Data evaluated as indicated in comments:
HL - Edward P. Hunter and Sharon G. Lias
Data compiled as indicated in comments:
B - John E. Bartmess
LLK - Sharon G. Lias, Rhoda D. Levin, and Sherif A. Kafafi
Quantity | Value | Units | Method | Reference | Comment |
---|---|---|---|---|---|
Proton affinity (review) | 957.8 | kJ/mol | N/A | Hunter and Lias, 1998 | HL |
Quantity | Value | Units | Method | Reference | Comment |
Gas basicity | 926.8 | kJ/mol | N/A | Hunter and Lias, 1998 | HL |
Ionization energy determinations
IE (eV) | Method | Reference | Comment |
---|---|---|---|
7.84 ± 0.03 | PI | Loguinov, Takhistov, et al., 1981 | LLK |
7.84 | PI | Akopyan, Vilesov, et al., 1975 | LLK |
7.84 ± 0.05 | PE | Akopyan and Loginov, 1974 | LLK |
Appearance energy determinations
Ion | AE (eV) | Other Products | Method | Reference | Comment |
---|---|---|---|---|---|
C2H6N+ | 8.58 | C3H5 | PI | Akopyan, Vilesov, et al., 1975 | LLK |
C3H5+ | 9.55 | C2H6N | PI | Akopyan, Vilesov, et al., 1975 | LLK |
C3H6+ | 9.58 | C2H5N | PI | Akopyan, Vilesov, et al., 1975 | LLK |
C3H8N+ | 9.55 ± 0.05 | C2H3 | PI | Loguinov, Takhistov, et al., 1981 | LLK |
C3H8N+ | 9.55 | C2H3 | PI | Akopyan, Vilesov, et al., 1975 | LLK |
C4H8N+ | 9.62 | CH3 | PI | Akopyan, Vilesov, et al., 1975 | LLK |
C5H10N+ | 9.56 | H | PI | Akopyan, Vilesov, et al., 1975 | LLK |
De-protonation reactions
C5H10N- + =
By formula: C5H10N- + H+ = C5H11N
Quantity | Value | Units | Method | Reference | Comment |
---|---|---|---|---|---|
ΔrH° | 1626. ± 17. | kJ/mol | G+TS | Dahlke and Kass, 1991 | gas phase; Between H2O, furan. Reprotonation site uncertain; B |
Quantity | Value | Units | Method | Reference | Comment |
ΔrG° | 1598. ± 17. | kJ/mol | IMRB | Dahlke and Kass, 1991 | gas phase; Between H2O, furan. Reprotonation site uncertain; B |

Normal alkane RI, non-polar column, temperature ramp

Column type | Active phase | I | Reference | Comment |
---|---|---|---|---|
Capillary | OV-101 | 604. | Zenkevich, 2005 | 25. m/0.20 mm/0.10 μm, N2/He, 6. K/min; Tstart: 50. C; Tend: 250. C |

References

Weast and Grasselli, 1989
CRC Handbook of Data on Organic Compounds, 2nd Editon, Weast,R.C and Grasselli, J.G., ed(s)., CRC Press, Inc., Boca Raton, FL, 1989, 1. [all data]
Katritzky, Pinzelli, et al., 1970
Katritzky, A.R.; Pinzelli, R.F.; Sinnot, M.V.; Topsom, R.D.,
Infrared INtensities as a Quantitative Measure of Intramoelcular Inter- actions XV. Monosubstituted Ethylenes,
J. Am. Chem. Soc., 1970, 92, 6861. [all data]
Dahlke and Kass, 1991
Dahlke, G.D.; Kass, S.R.,
Substituent Effects in the Gas Phase - 1-Substituted Allyl Anions,
J. Am. Chem. Soc., 1991, 113, 15, 5566, https://doi.org/10.1021/ja00015a008
. [all data]
Beldie, Aelenei, et al., 1982
Beldie, C.; Aelenei, N.; Onu, A.; Nemtoi, G.,
Thermochemical characterization of the reactions involved in the allyldimethylamine synthesis,
Rev. Chim. (Bucharest), 1982, 33, 917-919. [all data]
Hunter and Lias, 1998
Hunter, E.P.; Lias, S.G.,
Evaluated Gas Phase Basicities and Proton Affinities of Molecules: An Update,
J. Phys. Chem. Ref. Data, 1998, 27, 3, 413-656, https://doi.org/10.1063/1.556018
. [all data]
Loguinov, Takhistov, et al., 1981
Loguinov, Y.; Takhistov, V.V.; Vatlina, L.P.,
Photoionization studies of substituted trimethylamines,
Org. Mass Spectrom., 1981, 16, 239. [all data]
Akopyan, Vilesov, et al., 1975
Akopyan, M.E.; Vilesov, F.I.; Loginov, Y.V.,
Photoionization of amines and the monomolecular decomposition of excited molecular ions,
Khim. Vys. Energ., 1975, 9, 327. [all data]
Akopyan and Loginov, 1974
Akopyan, M.E.; Loginov, Yu.V.,
Photoelectron spectra of trimethylamine derivatives,
Opt. Spectrosc., 1974, 37, 250, In original 442. [all data]
Zenkevich, 2005
Zenkevich, I.G.,
Experimentally measured retention indices., 2005. [all data]