Benzyl-d7 radical
- Formula: C7D7
- Molecular weight: 98.1736
- IUPAC Standard InChIKey: SLRMQYXOBQWXCR-QMUWOJKRSA-N
- CAS Registry Number: 2154-55-4
- Chemical structure:
View 3d structure (requires JavaScript / HTML 5) - Isotopologues:

Gas phase ion energetics data

Data compiled by: Sharon G. Lias and Joel F. Liebman
Ionization energy determinations
IE (eV) | Method | Reference | Comment |
---|---|---|---|
7.2385 ± 0.0006 | LS | Eiden and Weisshaar, 1991 | T = 0K |

References

Eiden and Weisshaar, 1991
Eiden, G.C.; Weisshaar, J.C.,
Adiabatic ionization potential of benzyl radical by two-color resonant two-photon ionization,
J. Phys. Chem., 1991, 95, 6194. [all data]