Cyclopenta[ij]pyrido[2,1,6-de]quinolizine,3-methyl-
- Formula: C15H11N
- Molecular weight: 205.2545
- IUPAC Standard InChIKey: WYFGFMJAMANCMU-UHFFFAOYSA-N
- CAS Registry Number: 21533-76-6
- Chemical structure:
View 3d structure (requires JavaScript / HTML 5) - Permanent link for this species. Use this link for bookmarking this species for future reference.

Gas phase ion energetics data

Data compiled by: Sharon G. Lias, Rhoda D. Levin, and Sherif A. Kafafi
Ionization energy determinations
IE (eV) | Method | Reference | Comment |
---|---|---|---|
6.37 | PE | Palmer, Leaver, et al., 1977 | Vertical value |

References

Palmer, Leaver, et al., 1977
Palmer, M.H.; Leaver, D.; Nisbet, J.D.; Millar, R.W.; Egdell, R.,
The electronic structure of some J. Heterocycl. Chem. with bridgehead nitrogen: photoelectron spectra and ab initio molecular orbital calculations,
J. Mol. Struct., 1977, 42, 85. [all data]