Tetrabenz[a,c,h,j]anthracene
- Formula: C30H18
- Molecular weight: 378.4639
- IUPAC Standard InChIKey: RQBFBRABPQPCHC-UHFFFAOYSA-N
- CAS Registry Number: 215-11-2
- Chemical structure:
View 3d structure (requires JavaScript / HTML 5) - Permanent link for this species. Use this link for bookmarking this species for future reference.

Gas phase ion energetics data

Data compiled by: Sharon G. Lias, Rhoda D. Levin, and Sherif A. Kafafi
Ionization energy determinations
IE (eV) | Method | Reference | Comment |
---|---|---|---|
7.43 ± 0.02 | PE | Schmidt, 1977 | |
7.45 | PE | Clar and Schmidt, 1975 | |
7.45 ± 0.04 | PE | Boschi, Clar, et al., 1974 | |
7.43 | PE | Clar and Schmidt, 1976 | Vertical value |

References

Schmidt, 1977
Schmidt, W.,
Photoelectron spectra of polynuclear aromatics. V. Correlations with ultraviolet absorption spectra in the catacondensed series,
J. Chem. Phys., 1977, 66, 828. [all data]
Clar and Schmidt, 1975
Clar, E.; Schmidt, W.,
Correlations btween photoelectron and ultraviolet absorption spectra of polycyclic hydrocarbons and the number of aromatic sextets,
Tetrahedron, 1975, 31, 2263. [all data]
Boschi, Clar, et al., 1974
Boschi, R.; Clar, E.; Schmidt, W.,
Photoelectron spectra of polynuclear aromatics. III. The effect of nonplanarity in sterically overcrowded aromatic hydrocarbons,
J. Chem. Phys., 1974, 60, 4406. [all data]
Clar and Schmidt, 1976
Clar, E.; Schmidt, W.,
Correlations between photoelectron and phosphorescence spectra of polycyclic hydrocarbons,
Tetrahedron, 1976, 32, 2563. [all data]