Dichloro(phenyl)phosphinemolybdenum pentacarbonyl
- Formula: C11H5Cl2MoO5P
- Molecular weight: 414.99
- IUPAC Standard InChIKey: AOYVESUIDSYZES-UHFFFAOYSA-N
- CAS Registry Number: 21485-20-1
- Chemical structure:

Gas phase ion energetics data

Data compiled by: Henry M. Rosenstock, Keith Draxl, Bruce W. Steiner, and John T. Herron
Ionization energy determinations
IE (eV) | Method | Reference |
---|---|---|
8.03 ± 0.05 | EI | Distefano, Innorta, et al., 1968 |

References

Distefano, Innorta, et al., 1968
Distefano, G.; Innorta, G.; Pignataro, S.; Foffani, A.,
Correlation between the ionization potentials of transition metal complexes and of the corresponding ligands,
J. Organometal. Chem., 1968, 14, 165. [all data]