Acenaphthylene, dodecahydro-
- Formula: C12H20
- Molecular weight: 164.2872
- IUPAC Standard InChIKey: FZDZWLDRELLWNN-UHFFFAOYSA-N
- CAS Registry Number: 2146-36-3
- Chemical structure:
View 3d structure (requires JavaScript / HTML 5) - Species with the same structure:
- Other names: Decahydroacenaphthene; Perhydroacenaphthene, # 1; Perhydroacenaphthene, # 3; Perhydroacenaphthene, # 2; Perhydroacenaphthene, # 5; Perhydroacenaphthene, # 4; Perhydroacenaphthene, # 6; perhydroacenaphthene

Gas phase ion energetics data

Data compiled by: Sharon G. Lias, Rhoda D. Levin, and Sherif A. Kafafi
Ionization energy determinations
IE (eV) | Method | Reference |
---|---|---|
9.05 | PI | Fedorova, Potapov, et al., 1974 |

Kovats' RI, non-polar column, isothermal

Column type | Active phase | Temperature (C) | I | Reference | Comment |
---|---|---|---|---|---|
Capillary | SE-30 | 175. | 1295. | Bredael, 1982 | Column length: 100. m; Column diameter: 0.5 mm |
Capillary | SE-30 | 150. | 1300. | Bredael, 1982 | Column length: 100. m; Column diameter: 0.5 mm |
Capillary | SE-30 | 175. | 1318. | Bredael, 1982 | Column length: 100. m; Column diameter: 0.5 mm |
Capillary | SE-30 | 130. | 1302. | Bredael, 1982 | Column length: 100. m; Column diameter: 0.5 mm |
Capillary | SE-30 | 150. | 1320. | Bredael, 1982 | Column length: 100. m; Column diameter: 0.5 mm |
Capillary | SE-30 | 175. | 1342. | Bredael, 1982 | Column length: 100. m; Column diameter: 0.5 mm |
Capillary | SE-30 | 130. | 1307. | Bredael, 1982 | Column length: 100. m; Column diameter: 0.5 mm |
Capillary | SE-30 | 150. | 1325. | Bredael, 1982 | Column length: 100. m; Column diameter: 0.5 mm |
Capillary | SE-30 | 175. | 1347. | Bredael, 1982 | Column length: 100. m; Column diameter: 0.5 mm |
Capillary | SE-30 | 130. | 1334. | Bredael, 1982 | Column length: 100. m; Column diameter: 0.5 mm |
Capillary | SE-30 | 150. | 1353. | Bredael, 1982 | Column length: 100. m; Column diameter: 0.5 mm |
Capillary | SE-30 | 175. | 1377. | Bredael, 1982 | Column length: 100. m; Column diameter: 0.5 mm |
Capillary | SE-30 | 130. | 1364. | Bredael, 1982 | Column length: 100. m; Column diameter: 0.5 mm |
Capillary | SE-30 | 150. | 1380. | Bredael, 1982 | Column length: 100. m; Column diameter: 0.5 mm |
Packed | SE-30 | 150. | 1349. | Shlyakhov, Anvaer, et al., 1975 | |
Packed | SE-30 | 200. | 1393. | Shlyakhov, Anvaer, et al., 1975 | |
Packed | Apiezon L | 150. | 1384. | Shlyakhov, Anvaer, et al., 1975 |

References

Fedorova, Potapov, et al., 1974
Fedorova, M.S.; Potapov, V.K.; Denisov, Yu.V.; Sorokin, V.V.; Evlasheva, T.I.,
A mass-spectrometric study of the photoionisation of certain cyclic hydrocarbons,
Russ. J. Phys. Chem., 1974, 48, 1078, In original 1828. [all data]