Ethanone, 1-(3-bromophenyl)-
- Formula: C8H7BrO
- Molecular weight: 199.045
- IUPAC Standard InChIKey: JYAQYXOVOHJRCS-UHFFFAOYSA-N
- CAS Registry Number: 2142-63-4
- Chemical structure:
View 3d structure (requires JavaScript / HTML 5) - Other names: Acetophenone, 3'-bromo-; m-Bromoacetophenone; 3-Bromoacetophenone; 3'-Bromoacetophenone

Phase change data

Data compiled by: Robert L. Brown and Stephen E. Stein
Quantity | Value | Units | Method | Reference | Comment |
---|---|---|---|---|---|
Tfus | 280. to 281. | K | N/A | Buckingham and Donaghy, 1982 |
Reduced pressure boiling point
Tboil (K) | Pressure (bar) | Reference |
---|---|---|
404.2 | 0.021 | Weast and Grasselli, 1989 |
404. | 0.021 | Buckingham and Donaghy, 1982 |

Gas phase ion energetics data

Data compiled by: Henry M. Rosenstock, Keith Draxl, Bruce W. Steiner, and John T. Herron
Ionization energy determinations
IE (eV) | Method | Reference |
---|---|---|
9.6 ± 0.1 | EI | Chin and Harrison, 1969 |
Appearance energy determinations
Ion | AE (eV) | Other Products | Method | Reference | Comment |
---|---|---|---|---|---|
C7H4OBr+ | 10.5 ± 0.1 | CH3 | EI | Chin and Harrison, 1969 |

Kovats' RI, non-polar column, isothermal

Column type | Active phase | Temperature (C) | I | Reference | Comment |
---|---|---|---|---|---|
Packed | OV-101 | 160. | 1310.4 | Hassani and Meklati, 1992 | N2, Chromosorb G HP; Column length: 5. m |
Packed | OV-3 | 160. | 1375.5 | Hassani and Meklati, 1992 | N2, Chromosorb G HP; Column length: 5. m |

References

Buckingham and Donaghy, 1982
Buckingham, J.; Donaghy, S.M.,
Dictionary of Organic Compounds: Fifth Edition, Chapman and Hall, New York, 1982, 1. [all data]
Weast and Grasselli, 1989
CRC Handbook of Data on Organic Compounds, 2nd Editon, Weast,R.C and Grasselli, J.G., ed(s)., CRC Press, Inc., Boca Raton, FL, 1989, 1. [all data]
Chin and Harrison, 1969
Chin, M.S.; Harrison, A.G.,
Substituent effects on ion abundances and energetics in substituted acetophenones,
Org. Mass Spectrom., 1969, 2, 1073. [all data]
Hassani and Meklati, 1992
Hassani, A.; Meklati, B.Y.,
Gas chromatographic behaviour of monosubstituted benzenes, benzaldehydes and acetophenones on OV polymethylphenyl-silicone stationary phases,
Chromatographia, 1992, 33, 5/6, 267-271, https://doi.org/10.1007/BF02276193
. [all data]