35Chlorine monofluoride
- Formula: ClF
- Molecular weight: 54.451
- IUPAC Standard InChIKey: OMRRUNXAWXNVFW-IGMARMGPSA-N
- CAS Registry Number: 21377-80-0
- Chemical structure:
View 3d structure (requires JavaScript / HTML 5) - Isotopologues:

Gas phase ion energetics data

Data compiled by: Sharon G. Lias, Rhoda D. Levin, and Sherif A. Kafafi
Ionization energy determinations
IE (eV) | Method | Reference |
---|---|---|
12.60 ± 0.05 | EI | Dudin, Gorokhov, et al., 1979 |

Constants of diatomic molecules

Data compiled by: Klaus P. Huber and Gerhard H. Herzberg
Data collected through September, 1976
Symbol | Meaning |
---|---|
State | electronic state and / or symmetry symbol |
Te | minimum electronic energy (cm-1) |
ωe | vibrational constant – first term (cm-1) |
ωexe | vibrational constant – second term (cm-1) |
ωeye | vibrational constant – third term (cm-1) |
Be | rotational constant in equilibrium position (cm-1) |
αe | rotational constant – first term (cm-1) |
γe | rotation-vibration interaction constant (cm-1) |
De | centrifugal distortion constant (cm-1) |
βe | rotational constant – first term, centrifugal force (cm-1) |
re | internuclear distance (Å) |
Trans. | observed transition(s) corresponding to electronic state |
ν00 | position of 0-0 band (units noted in table) |
State | Te | ωe | ωexe | ωeye | Be | αe | γe | De | βe | re | Trans. | ν00 |
---|---|---|---|---|---|---|---|---|---|---|---|---|
For binding energies of F(1s) and Cl(2s) core electrons in ClF see Carroll and Thomas, 1974. | ||||||||||||
B 3Π0+ | 18826.4 | 363.1 Z | 8.64 1 | -0.124 | 0.3319 | 0.0047 | -0.000477 | (1.0E-06) | 2.031 | B ← X | 18614.3 2 Z | |
↳Schumacher, Schmitz, et al., 1950; Stricker and Krauss, 1968 | ||||||||||||
X 1Σ+ | 0 | 786.15 3 Z | 6.161 3 | 0.5164788 | 0.0043577 | 8.77E-07 | 1.628313 | 4 | ||||
↳Nielsen and Jones, 1951; Jones, Parkinson, et al., 1950; Davis and Muenter, 1972; Lovas and Tiemann, 1974 |

References

Dudin, Gorokhov, et al., 1979
Dudin, A.V.; Gorokhov, L.N.; Baluev, A.V.,
A study of the electron-impact ionization of chlorine trifluoride and its decomposition products by mass spectrometry,
Bull. Acad. Sci. USSR, Div. Chem. Sci., 1979, 11, 2408. [all data]