Cesium hydroxide
- Formula: CsHO
- Molecular weight: 149.9128
- IUPAC Standard InChIKey: HUCVOHYBFXVBRW-UHFFFAOYSA-M
- CAS Registry Number: 21351-79-1
- Chemical structure:

Gas phase thermochemistry data

Quantity | Value | Units | Method | Reference | Comment |
---|---|---|---|---|---|
ΔfH°gas | -259.41 | kJ/mol | Review | Chase, 1998 | Data last reviewed in June, 1971 |
Quantity | Value | Units | Method | Reference | Comment |
S°gas,1 bar | 254.81 | J/mol*K | Review | Chase, 1998 | Data last reviewed in June, 1971 |
Gas Phase Heat Capacity (Shomate Equation)
Cp° = A + B*t + C*t2 + D*t3 +
E/t2
H° − H°298.15= A*t + B*t2/2 +
C*t3/3 + D*t4/4 − E/t + F − H
S° = A*ln(t) + B*t + C*t2/2 + D*t3/3 −
E/(2*t2) + G
Cp = heat capacity (J/mol*K)
H° = standard enthalpy (kJ/mol)
S° = standard entropy (J/mol*K)
t = temperature (K) / 1000.
View plot Requires a JavaScript / HTML 5 canvas capable browser.
Temperature (K) | 2000. to 6000. |
---|---|
A | 49.63521 |
B | 6.922637 |
C | -1.377616 |
D | 0.094260 |
E | -0.147846 |
F | -275.0034 |
G | 312.0406 |
H | -259.4084 |
Reference | Chase, 1998 |
Comment | Data last reviewed in June, 1971 |

Condensed phase thermochemistry data

Quantity | Value | Units | Method | Reference | Comment |
---|---|---|---|---|---|
ΔfH°liquid | -405.97 | kJ/mol | Review | Chase, 1998 | Data last reviewed in June, 1971 |
Quantity | Value | Units | Method | Reference | Comment |
S°liquid,1 bar | 118.51 | J/mol*K | Review | Chase, 1998 | Data last reviewed in June, 1971 |
Quantity | Value | Units | Method | Reference | Comment |
ΔfH°solid | -416.73 | kJ/mol | Review | Chase, 1998 | Data last reviewed in June, 1971 |
Quantity | Value | Units | Method | Reference | Comment |
S°solid | 98.74 | J/mol*K | Review | Chase, 1998 | Data last reviewed in June, 1971 |
Liquid Phase Heat Capacity (Shomate Equation)
Cp° = A + B*t + C*t2 + D*t3 +
E/t2
H° − H°298.15= A*t + B*t2/2 +
C*t3/3 + D*t4/4 − E/t + F − H
S° = A*ln(t) + B*t + C*t2/2 + D*t3/3 −
E/(2*t2) + G
Cp = heat capacity (J/mol*K)
H° = standard enthalpy (kJ/mol)
S° = standard entropy (J/mol*K)
t = temperature (K) / 1000.
View plot Requires a JavaScript / HTML 5 canvas capable browser.
Temperature (K) | 588. to 2000. |
---|---|
A | 81.58800 |
B | 0.000000 |
C | 0.000000 |
D | 0.000000 |
E | 0.000000 |
F | -430.2951 |
G | 217.2475 |
H | -405.9706 |
Reference | Chase, 1998 |
Comment | Data last reviewed in June, 1971 |
Solid Phase Heat Capacity (Shomate Equation)
Cp° = A + B*t + C*t2 + D*t3 +
E/t2
H° − H°298.15= A*t + B*t2/2 +
C*t3/3 + D*t4/4 − E/t + F − H
S° = A*ln(t) + B*t + C*t2/2 + D*t3/3 −
E/(2*t2) + G
Cp = heat capacity (J/mol*K)
H° = standard enthalpy (kJ/mol)
S° = standard entropy (J/mol*K)
t = temperature (K) / 1000.
View plot Requires a JavaScript / HTML 5 canvas capable browser.
Temperature (K) | 298. to 410. | 410. to 493. | 493. to 588. |
---|---|---|---|
A | -177.0160 | -7247.910 | 83.67990 |
B | 1323.210 | 42467.60 | 0.000411 |
C | -2599.410 | -87147.90 | -0.000423 |
D | 1882.890 | 61260.30 | 0.000153 |
E | 2.803520 | 56.96420 | 0.000007 |
F | -394.1140 | 703.0910 | -436.0870 |
G | -395.3210 | -17662.50 | 210.6020 |
H | -416.7260 | -416.7260 | -416.7260 |
Reference | Chase, 1998 | Chase, 1998 | Chase, 1998 |
Comment | Data last reviewed in June, 1971 | Data last reviewed in June, 1971 | Data last reviewed in June, 1971 |

Reaction thermochemistry data

Data compiled by: José A. Martinho Simões
Individual Reactions
C2HCs (cr) + (l) = (
• 1031
) (solution) +
(g)
By formula: C2HCs (cr) + H2O (l) = (HCsO • 1031H2O) (solution) + C2H2 (g)
Quantity | Value | Units | Method | Reference | Comment |
---|---|---|---|---|---|
ΔrH° | -54.0 ± 0.8 | kJ/mol | RSC | Ader and Hubbard, 1973 | Please also see Pedley and Rylance, 1977. |

Gas phase ion energetics data

Data evaluated as indicated in comments:
HL - Edward P. Hunter and Sharon G. Lias
Data compiled as indicated in comments:
RDSH - Henry M. Rosenstock, Keith Draxl, Bruce W. Steiner, and John T. Herron
Quantity | Value | Units | Method | Reference | Comment |
---|---|---|---|---|---|
Proton affinity (review) | 1117.9 | kJ/mol | N/A | Hunter and Lias, 1998 | HL |
Quantity | Value | Units | Method | Reference | Comment |
Gas basicity | 1092.2 | kJ/mol | N/A | Hunter and Lias, 1998 | HL |
Ionization energy determinations
IE (eV) | Method | Reference | Comment |
---|---|---|---|
7.40 ± 0.15 | EI | Gorokhov, Gusarov, et al., 1970 | RDSH |
7.21 ± 0.14 | EI | Emel'yanov, Gusarov, et al., 1967 | RDSH |
Appearance energy determinations
Ion | AE (eV) | Other Products | Method | Reference | Comment |
---|---|---|---|---|---|
Cs+ | 7.60 ± 0.15 | OH | EI | Gorokhov, Gusarov, et al., 1970 | RDSH |
Cs+ | 7.46 ± 0.14 | OH | EI | Emel'yanov, Gusarov, et al., 1967 | RDSH |
Cs+ | ~10. | OH | EI | Schoonmaker and Porter, 1959 | RDSH |

References

Chase, 1998
Chase, M.W., Jr.,
NIST-JANAF Themochemical Tables, Fourth Edition,
J. Phys. Chem. Ref. Data, Monograph 9, 1998, 1-1951. [all data]
Ader and Hubbard, 1973
Ader, M.; Hubbard, W.N.,
J. Chem. Thermodyn., 1973, 5, 607. [all data]
Pedley and Rylance, 1977
Pedley, J.B.; Rylance, J.,
Computer Analysed Thermochemical Data: Organic and Organometallic Compounds, University of Sussex, Brigton, 1977. [all data]
Hunter and Lias, 1998
Hunter, E.P.; Lias, S.G.,
Evaluated Gas Phase Basicities and Proton Affinities of Molecules: An Update,
J. Phys. Chem. Ref. Data, 1998, 27, 3, 413-656, https://doi.org/10.1063/1.556018
. [all data]
Gorokhov, Gusarov, et al., 1970
Gorokhov, L.N.; Gusarov, A.V.; Panchenkov, I.G.,
Determination of dissociation energies of potassium and caesium hydroxides by electron bombardment,
Zh. Fiz. Khim., 1970, 44, 269, In original 150. [all data]
Emel'yanov, Gusarov, et al., 1967
Emel'yanov, A.M.; Gusarov, A.V.; Gorokhov, L.N.; Sadovnikova, N.A.,
Electron-impact studies of the vapors of cesium oxide and hydroxide,
Teor. i Eksperim, Khim., 1967, 3, 226, In original 126. [all data]
Schoonmaker and Porter, 1959
Schoonmaker, R.C.; Porter, R.F.,
Mass spectrometric study of alkali hydroxide vapors,
J. Chem. Phys., 1959, 31, 830. [all data]