Picene
- Formula: C22H14
- Molecular weight: 278.3466
- IUPAC Standard InChIKey: GBROPGWFBFCKAG-UHFFFAOYSA-N
- CAS Registry Number: 213-46-7
- Chemical structure:
View 3d structure (requires JavaScript / HTML 5) - Other names: 1,2:7,8-Dibenzophenanthrene; β,β-Binaphthyleneethene; Benzo(a)chrysene; Dibenzo(a,i)phenanthrene; Pycene; 1,2,7,8-Dibenzphenanthrene; 3,4-Benzchrysene; 1,2:7,8-Dibenzphenanthrene; NSC 406006

Gas phase thermochemistry data

Data compiled by: Glushko Thermocenter, Russian Academy of Sciences, Moscow
Constant pressure heat capacity of gas
Cp,gas (J/mol*K) | Temperature (K) | Reference | Comment |
---|---|---|---|
57.43 | 50. | Dorofeeva O.V., 1988 | Recommended values were calculated statistically mechanically using force field approximation for polycyclic aromatic hydrocarbons to estimate the needed vibrational frequencies (see also [ Dorofeeva O.V., 1986, Moiseeva N.F., 1989]). These functions are reproduced in the reference book [ Frenkel M., 1994]. |
93.39 | 100. | ||
135.57 | 150. | ||
183.56 | 200. | ||
258.98 | 273.15 | ||
284.8 ± 3.5 | 298.15 | ||
286.73 | 300. | ||
383.40 | 400. | ||
464.03 | 500. | ||
528.51 | 600. | ||
579.98 | 700. | ||
621.57 | 800. | ||
655.66 | 900. | ||
683.94 | 1000. | ||
707.63 | 1100. | ||
727.62 | 1200. | ||
744.60 | 1300. | ||
759.12 | 1400. | ||
771.59 | 1500. |

Phase change data

Data compiled as indicated in comments:
TRC - Thermodynamics Research Center, NIST Boulder Laboratories, Chris Muzny director
AC - William E. Acree, Jr., James S. Chickos
Quantity | Value | Units | Method | Reference | Comment |
---|---|---|---|---|---|
Tfus | 639. ± 3. | K | AVG | N/A | Average of 7 values; Individual data points |
Enthalpy of sublimation
ΔsubH (kJ/mol) | Temperature (K) | Method | Reference | Comment |
---|---|---|---|---|
140.7 | 424. | N/A | Stephenson and Malanowski, 1987 | Based on data from 409. to 527. K.; AC |
140.1 | 456. | ME | Wakayama and Inokuchi, 1967 | Based on data from 425. to 488. K.; AC |
Enthalpy of fusion
ΔfusH (kJ/mol) | Temperature (K) | Reference | Comment |
---|---|---|---|
35.19 | 637.2 | Smith, 1980 | AC |

Gas phase ion energetics data

Data evaluated as indicated in comments:
HL - Edward P. Hunter and Sharon G. Lias
L - Sharon G. Lias
Data compiled as indicated in comments:
MM - Michael M. Meot-Ner (Mautner)
LLK - Sharon G. Lias, Rhoda D. Levin, and Sherif A. Kafafi
RDSH - Henry M. Rosenstock, Keith Draxl, Bruce W. Steiner, and John T. Herron
B - John E. Bartmess
Quantity | Value | Units | Method | Reference | Comment |
---|---|---|---|---|---|
IE (evaluated) | 7.51 ± 0.02 | eV | N/A | N/A | L |
Quantity | Value | Units | Method | Reference | Comment |
Proton affinity (review) | 851.3 | kJ/mol | N/A | Hunter and Lias, 1998 | HL |
Quantity | Value | Units | Method | Reference | Comment |
Gas basicity | 820.6 | kJ/mol | N/A | Hunter and Lias, 1998 | HL |
Electron affinity determinations
EA (eV) | Method | Reference | Comment |
---|---|---|---|
0.5420 ± 0.0080 | ECD | Becker and Chen, 1966 | B |
Proton affinity at 298K
Proton affinity (kJ/mol) | Reference | Comment |
---|---|---|
843.5 | Aue, Guidoni, et al., 2000 | Experimental literature data re-evaluated by the authors using ab initio protonation entropies; MM |
Gas basicity at 298K
Gas basicity (review) (kJ/mol) | Reference | Comment |
---|---|---|
818.0 | Aue, Guidoni, et al., 2000 | Experimental literature data re-evaluated by the authors using ab initio protonation entropies; MM |
Ionization energy determinations
IE (eV) | Method | Reference | Comment |
---|---|---|---|
7.48 ± 0.05 | EQ | Mautner(Meot-Ner), 1980 | LLK |
7.50 | PE | Clar and Schmidt, 1979 | LLK |
7.54 ± 0.04 | PE | Boschi, Clar, et al., 1974 | LLK |
7.8 ± 0.1 | EI | Gallegos, 1968 | RDSH |
7.75 | CTS | Briegleb, 1964 | RDSH |
7.80 | CTS | Birks and Stifkin, 1961 | RDSH |
7.62 | CTS | Matsen, 1956 | RDSH |
7.52 ± 0.02 | PE | Schmidt, 1977 | Vertical value; LLK |
7.52 | PE | Clar and Schmidt, 1976 | Vertical value; LLK |

References

Dorofeeva O.V., 1988
Dorofeeva O.V.,
Thermodynamic Properties of Polycyclic Aromatic Hydrocarbons in the Gaseous Phase. Institute for High Temperatures, USSR Academy of Sciences, Preprint No.1-238 (in Russian), Moscow, 1988. [all data]
Dorofeeva O.V., 1986
Dorofeeva O.V.,
On calculation of thermodynamic properties of polycyclic aromatic hydrocarbons,
Thermochim. Acta, 1986, 102, 59-66. [all data]
Moiseeva N.F., 1989
Moiseeva N.F.,
Development of Benson group additivity method for estimation of ideal gas thermodynamic properties of polycyclic aromatic hydrocarbons,
Thermochim. Acta, 1989, 153, 77-85. [all data]
Frenkel M., 1994
Frenkel M.,
Thermodynamics of Organic Compounds in the Gas State, Vol. I, II, Thermodynamics Research Center, College Station, Texas, 1994, 1994. [all data]
Stephenson and Malanowski, 1987
Stephenson, Richard M.; Malanowski, Stanislaw,
Handbook of the Thermodynamics of Organic Compounds, 1987, https://doi.org/10.1007/978-94-009-3173-2
. [all data]
Wakayama and Inokuchi, 1967
Wakayama, Nobuko; Inokuchi, Hiroo,
Heats of Sublimation of Polycyclic Aromatic Hydrocarbons and Their Molecular Packings,
Bull. Chem. Soc. Jpn., 1967, 40, 10, 2267-2271, https://doi.org/10.1246/bcsj.40.2267
. [all data]
Smith, 1980
Smith, George W.,
Phase Behavior of some Condensed Polycyclic Aromatics,
Molecular Crystals and Liquid Crystals, 1980, 64, 1, 15-17, https://doi.org/10.1080/01406568008072649
. [all data]
Hunter and Lias, 1998
Hunter, E.P.; Lias, S.G.,
Evaluated Gas Phase Basicities and Proton Affinities of Molecules: An Update,
J. Phys. Chem. Ref. Data, 1998, 27, 3, 413-656, https://doi.org/10.1063/1.556018
. [all data]
Becker and Chen, 1966
Becker, R.S.; Chen, E.,
Extension of Electron Affinities and Ionization Potentials of Aromatic Hydrocarbons,
J. Chem. Phys., 1966, 45, 7, 2403, https://doi.org/10.1063/1.1727954
. [all data]
Aue, Guidoni, et al., 2000
Aue, D.H.; Guidoni, M.; Betowski, L.D.,
Ab initio calculated gas-phase basicities of polynuclear aromatic hydrocarbons,
Int. J. Mass Spectrom., 2000, 201, 283. [all data]
Mautner(Meot-Ner), 1980
Mautner(Meot-Ner), M.,
Ion thermochemistry of low volatility compounds in the gas phase. 3. Polycyclic aromatics: Ionization energies, proton, and hydrogen affinities. Extrapolations to graphite,
J. Phys. Chem., 1980, 84, 2716. [all data]
Clar and Schmidt, 1979
Clar, E.; Schmidt, W.,
Correlations between photoelectron and UV absorption spectra of polycyclic hydrocarbons. The pyrene series,
Tetrahedron, 1979, 35, 1027. [all data]
Boschi, Clar, et al., 1974
Boschi, R.; Clar, E.; Schmidt, W.,
Photoelectron spectra of polynuclear aromatics. III. The effect of nonplanarity in sterically overcrowded aromatic hydrocarbons,
J. Chem. Phys., 1974, 60, 4406. [all data]
Gallegos, 1968
Gallegos, E.J.,
Mass spectrometry and ionization energies of some condensed-ring aromatic and heterocyclic compounds,
J. Phys. Chem., 1968, 72, 3452. [all data]
Briegleb, 1964
Briegleb, G.,
Electron affinity of organic molecules,
Angew. Chem. Intern. Ed., 1964, 3, 617. [all data]
Birks and Stifkin, 1961
Birks, J.B.; Stifkin, M.A.,
π-Electronic excitation and ionization energies of condensed ring aromatic hydrocarbons,
Nature, 1961, 191, 761. [all data]
Matsen, 1956
Matsen, F.A.,
Electron affinities, methyl affinities, and ionization energies of condensed ring aromatic hydrocarbons,
J. Chem. Phys., 1956, 24, 602. [all data]
Schmidt, 1977
Schmidt, W.,
Photoelectron spectra of polynuclear aromatics. V. Correlations with ultraviolet absorption spectra in the catacondensed series,
J. Chem. Phys., 1977, 66, 828. [all data]
Clar and Schmidt, 1976
Clar, E.; Schmidt, W.,
Correlations between photoelectron and phosphorescence spectra of polycyclic hydrocarbons,
Tetrahedron, 1976, 32, 2563. [all data]