Cobalt, tricarbonylhydro(phosphorus trifluoride)-
- Formula: C3HCoF3O3P
- Molecular weight: 231.9404
- IUPAC Standard InChIKey: BDCMIOYDUUNVBP-UHFFFAOYSA-N
- CAS Registry Number: 21329-74-8
- Chemical structure:

Gas phase ion energetics data

Data compiled by: Henry M. Rosenstock, Keith Draxl, Bruce W. Steiner, and John T. Herron
Ionization energy determinations
IE (eV) | Method | Reference |
---|---|---|
9.8 ± 0.2 | EI | Saalfeld, McDowell, et al., 1968 |
Appearance energy determinations
Ion | AE (eV) | Other Products | Method | Reference | Comment |
---|---|---|---|---|---|
COF3PCo+ | 14.3 ± 0.3 | ? | EI | Saalfeld, McDowell, et al., 1968 | |
CoCO+ | 15.5 ± 0.2 | ? | EI | Saalfeld, McDowell, et al., 1968 | |
CHOF3PCo+ | 12.5 ± 0.3 | 2CO | EI | Saalfeld, McDowell, et al., 1968 | |
CHOCo+ | 12.1 ± 0.2 | ? | EI | Saalfeld, McDowell, et al., 1968 | |
CoC2O2+ | 14.0 ± 0.2 | ? | EI | Saalfeld, McDowell, et al., 1968 | |
C2HO2F3PCo+ | 10.3 ± 0.3 | CO | EI | Saalfeld, McDowell, et al., 1968 | |
C2HO2Co+ | 12.4 ± 0.3 | ? | EI | Saalfeld, McDowell, et al., 1968 | |
CoC3O3+ | 12.1 ± 0.2 | ? | EI | Saalfeld, McDowell, et al., 1968 | |
C3HO3Co+ | 9.9 ± 0.2 | ? | EI | Saalfeld, McDowell, et al., 1968 | |
Co+ | 17.8 ± 0.3 | ? | EI | Saalfeld, McDowell, et al., 1968 | |
CoHPF3+ | 13.8 ± 0.2 | 3CO | EI | Saalfeld, McDowell, et al., 1968 | |
CoPF3+ | 15.7 ± 0.2 | ? | EI | Saalfeld, McDowell, et al., 1968 | |
CoH+ | 14.6 ± 0.3 | ? | EI | Saalfeld, McDowell, et al., 1968 |

References

Saalfeld, McDowell, et al., 1968
Saalfeld, F.E.; McDowell, M.V.; Gondal, S.K.; MacDiarmid, A.G.,
The mass spectra of trifluorophosphinecarbonylcobalt hydrides,
J. Am. Chem. Soc., 1968, 90, 3684. [all data]