1,3-Propanediamine, N,N,N',N'-tetrafluoro-
- Formula: C3H6F4N2
- Molecular weight: 146.0868
- IUPAC Standard InChIKey: GHHKHIUEXGNVKP-UHFFFAOYSA-N
- CAS Registry Number: 21298-22-6
- Chemical structure:
View 3d structure (requires JavaScript / HTML 5) - Permanent link for this species. Use this link for bookmarking this species for future reference.

Gas phase ion energetics data

Data compiled by: Sharon G. Lias, Rhoda D. Levin, and Sherif A. Kafafi
Appearance energy determinations
Ion | AE (eV) | Other Products | Method | Reference | Comment |
---|---|---|---|---|---|
CHNF2+ | 13.7 ± 0.3 | ? | EI | Hertzberg, White, et al., 1972 | |
CH2NF+ | 11.9 ± 0.2 | ? | EI | Hertzberg, White, et al., 1972 | |
CH2NF2+ | 13.6 ± 0.3 | ? | EI | Hertzberg, White, et al., 1972 | |
CH3+ | 14.6 ± 0.3 | ? | EI | Hertzberg, White, et al., 1972 | |
C2H3NF+ | 16.8 ± 0.4 | ? | EI | Hertzberg, White, et al., 1972 | |
C2H6NF2+ | 11.8 ± 0.3 | ? | EI | Hertzberg, White, et al., 1972 | |
C3H6N+ | 15.6 ± 0.4 | ? | EI | Hertzberg, White, et al., 1972 | |
NF+ | 13.0 ± 0.3 | ? | EI | Hertzberg, White, et al., 1972 | |
NF2+ | 14.8 ± 0.4 | ? | EI | Hertzberg, White, et al., 1972 |

References

Hertzberg, White, et al., 1972
Hertzberg, M.; White, G.; Olfky, R.S.; Saalfeld, F.E.,
Bisdifluoraminoalkanes: the mass spectral decomposition of isomeric propanes,
J. Phys. Chem., 1972, 76, 60. [all data]