2,4-Hexadiene, 3,4-dimethyl-, (Z,Z)-
- Formula: C8H14
- Molecular weight: 110.1968
- IUPAC Standard InChIKey: PBGBMQLUDCDJQJ-SFECMWDFSA-N
- CAS Registry Number: 21293-01-6
- Chemical structure:
View 3d structure (requires JavaScript / HTML 5) - Stereoisomers:
- Other names: (Z),(Z)-(CH3CH=C(CH3))2

Gas phase thermochemistry data

Data compiled by: Hussein Y. Afeefy, Joel F. Liebman, and Stephen E. Stein
Quantity | Value | Units | Method | Reference | Comment |
---|---|---|---|---|---|
ΔfH°gas | -3.8 | kJ/mol | Chyd | Roth, Lennartz, et al., 1988 |

Reaction thermochemistry data

Data compiled by: Hussein Y. Afeefy, Joel F. Liebman, and Stephen E. Stein
Individual Reactions
By formula: 2H2 + C8H14 = C8H18
Quantity | Value | Units | Method | Reference | Comment |
---|---|---|---|---|---|
ΔrH° | -213.6 ± 0.8 | kJ/mol | Chyd | Roth, Lennartz, et al., 1988 | liquid phase; solvent: Isooctane |

Gas phase ion energetics data

Data compiled as indicated in comments:
LBLHLM - Sharon G. Lias, John E. Bartmess, Joel F. Liebman, John L. Holmes, Rhoda D. Levin, and W. Gary Mallard
Ionization energy determinations
IE (eV) | Method | Reference | Comment |
---|---|---|---|
8.1 | PE | Honegger, Zhong-zhi, et al., 1984 | LBLHLM |

Phase change data

Data compiled by: Thermodynamics Research Center, NIST Boulder Laboratories, Chris Muzny director
Quantity | Value | Units | Method | Reference | Comment |
---|---|---|---|---|---|
Tboil | 377.15 | K | N/A | Reeve and Reichel, 1972 | Uncertainty assigned by TRC = 1.5 K |

References

Roth, Lennartz, et al., 1988
Roth, W.R.; Lennartz, H-W.; Doering, W.v.E.; Dolbier, W.R., Jr.; Schmidhauser, J.C.,
Thermochemistry of the "orthogonal" butadienes (Z,Z)-3,4-dimethylhexa-2,4-diene and 2,3-di-tert-butylbuta-1,3-diene,
J. Am. Chem. Soc., 1988, 110, 1883-1889. [all data]
Honegger, Zhong-zhi, et al., 1984
Honegger, E.; Zhong-zhi, Y.; Heilbronner, E.; Doering, W.V.E.; Schmidhauser, J.C.,
Photoelectron-spectroscopic characterization of 3,4-dimethyl-2,4-hexadienes,
Helv. Chim. Acta, 1984, 67, 640. [all data]