Methyl-d3 radical
- Formula: CD3
- Molecular weight: 18.0530
- IUPAC Standard InChIKey: WCYWZMWISLQXQU-FIBGUPNXSA-N
- CAS Registry Number: 2122-44-3
- Chemical structure:
View 3d structure (requires JavaScript / HTML 5) - Species with the same structure:
- Isotopologues:

Gas phase ion energetics data

Data compiled as indicated in comments:
LLK - Sharon G. Lias, Rhoda D. Levin, and Sherif A. Kafafi
RDSH - Henry M. Rosenstock, Keith Draxl, Bruce W. Steiner, and John T. Herron
Ionization energy determinations
IE (eV) | Method | Reference | Comment |
---|---|---|---|
9.5 ± 0.1 | EI | Reeher, Flesch, et al., 1976 | LLK |
9.832 ± 0.002 | S | Herzberg and Shoosmith, 1956 | RDSH |
9.831 ± 0.007 | PE | Dyke, Jonathan, et al., 1976 | Vertical value; LLK |

References

Reeher, Flesch, et al., 1976
Reeher, J.R.; Flesch, G.D.; Svec, H.J.,
The mass spectra and ionization potentials of the neutral fragments produced during the electron bombardment of aromatic compounds,
Org. Mass Spectrom., 1976, 11, 154. [all data]
Herzberg and Shoosmith, 1956
Herzberg, G.; Shoosmith, J.,
Absorption spectrum of free CH3 and CD3 radicals,
Can. J. Phys., 1956, 34, 523. [all data]
Dyke, Jonathan, et al., 1976
Dyke, J.; Jonathan, N.; Lee, E.; Morris, A.,
Vacuum ultraviolet photoelectron spectroscopy of transient species,
J. Chem. Soc. Faraday Trans. 2, 1976, 72, 1385. [all data]