Benzyl(chloro)mercury
- Formula: C7H7ClHg
- Molecular weight: 327.17
- IUPAC Standard InChIKey: VLGACEINHFQTIJ-UHFFFAOYSA-M
- CAS Registry Number: 2117-39-7
- Chemical structure:
View 3d structure (requires JavaScript / HTML 5) - Other names: Mercury, chloro(phenylmethyl)-

Gas phase ion energetics data

Data compiled as indicated in comments:
LBLHLM - Sharon G. Lias, John E. Bartmess, Joel F. Liebman, John L. Holmes, Rhoda D. Levin, and W. Gary Mallard
LLK - Sharon G. Lias, Rhoda D. Levin, and Sherif A. Kafafi
Ionization energy determinations
IE (eV) | Method | Reference | Comment |
---|---|---|---|
8.71 ± 0.05 | PE | Baidin, Timoshenko, et al., 1985 | Vertical value; LBLHLM |
8.65 | PE | Schmidt, Schweig, et al., 1975 | Vertical value; LLK |

References

Baidin, Timoshenko, et al., 1985
Baidin, V.N.; Timoshenko, M.M.; Chizhov, Y.V.; Ustynyuk, Y.A.; Kritskaya, I.I.,
Photoelectron spectra nad the structure of organomercury compounds,
J. Organomet. Chem., 1985, 292, 55. [all data]
Schmidt, Schweig, et al., 1975
Schmidt, H.; Schweig, A.; Manuel, G.,
Vapourphase conformation of benzylmercuric chloride,
J. Chem. Soc., Chem. Commun., 1975, 667. [all data]