1-Cyclohexene-1-carboxaldehyde, 4-(1-methylethenyl)-
- Formula: C10H14O
- Molecular weight: 150.2176
- IUPAC Standard InChIKey: RUMOYJJNUMEFDD-UHFFFAOYSA-N
- CAS Registry Number: 2111-75-3
- Chemical structure:
View 3d structure (requires JavaScript / HTML 5) - Species with the same structure:
- Stereoisomers:
- Other names: 1-Cyclohexene-1-carboxaldehyde, 4-isopropenyl-; Perilla aldehyde; Perillal; Perillaldehyde; p-Mentha-1,8-dien-7-al; Dihydrocuminyl aldehyde; 4-Isopropenyl-1-cyclohexene-1-carboxaldehyde; para-Mentha-1,8-dien-7-al; Perillyl aldehyde; NSC 138642; 4-Isopropenyl-1-cyclohexene-1-carbaldehyde; 6611-91-2; 21090-66-4; α-Perilla aldehyde; p-Isopropenyl cyclohexencarbaldehyde; perrilaldehyde; Perrilla aldehyde; 4-isopropenylcyclohex-1-enecarbaldehyde

Gas phase ion energetics data

Data compiled by: Henry M. Rosenstock, Keith Draxl, Bruce W. Steiner, and John T. Herron
Ionization energy determinations
IE (eV) | Method | Reference |
---|---|---|
10.10 | EI | Bunau, Schade, et al., 1967 |
Appearance energy determinations
Ion | AE (eV) | Other Products | Method | Reference | Comment |
---|---|---|---|---|---|
C9H11O+ | 10.4 | CH3 | EI | Bunau, Schade, et al., 1967 |

Normal alkane RI, non-polar column, custom temperature program

Data compiled by: NIST Mass Spectrometry Data Center, William E. Wallace, director

Column type CapillaryCapillaryCapillaryCapillaryCapillary
Active phase Polydimethyl siloxane with 5 % Ph groupsPolydimethyl siloxane with 5 % Ph groupsHP-5DB-5SLB-5 MS
Column length (m)   30.60.10.
Carrier gas   NitrogenHeliumHelium
Substrate
Column diameter (mm)   0.250.250.10
Phase thickness (μm)   0.251.000.10
Program not specifiednot specified35 0C (10 min) 3 0C/min -> 205 0C 10 0C/min -> 225 0C40 0C 4 0C/min -> 230 0C 100 0C/min -> 260 0C (11.7 min)not specified
I 1295.1303.1272.1293.1278.
ReferenceRobinson, Adams, et al., 2012Robinson, Adams, et al., 2012Laribi, Kouki, et al., 2011Miyazaki, Plotto, et al., 2011Scandinaro, Tranchida, et al., 2010
Comment MSDC-RI MSDC-RI MSDC-RI MSDC-RI MSDC-RI
Column type CapillaryCapillaryCapillaryCapillaryCapillary
Active phase HP-5 MS5 % Phenyl methyl siloxaneHP-5SLB-5 MSHP-5
Column length (m) 60.30.30.30.30.
Carrier gas HeliumHelium HeliumHelium
Substrate
Column diameter (mm) 0.320.250.320.250.25
Phase thickness (μm) 1.00.25 0.250.25
Program 120 0C 2 0C/min -> 240 0C 10 0C/min -> 270 0C (2 min)50 0C (2 min) 10 0C/min -> 150 0C 15 0C/min -> 300 0C (10 min)not specifiednot specified40 0C (3 min) 3 0C/min -> 160 0C (2 min) 8 0C/min -> 220 0C (3 min)
I 1309.1270.1272.1278.1277.
ReferenceDharmawan, Kasapis, et al., 2009Huang, Qin, et al., 2009Riahi, Pourbasheer, et al., 2009Lo Presti, Sciarrone, et al., 2008Qiao, Xie, et al., 2008
Comment MSDC-RI MSDC-RI MSDC-RI MSDC-RI MSDC-RI
Column type CapillaryCapillaryCapillaryCapillaryCapillary
Active phase HP-5DB-5CP Sil 8 CBHP-5SE-30
Column length (m) 30.30.50.30.
Carrier gas HeliumHydrogenHeHe
Substrate
Column diameter (mm) 0.250.250.320.25
Phase thickness (μm) 0.250.250.250.25
Program not specifiednot specified60C(2min) => 5C/min => 160C(1min) => 10C/min => 250C (5min)60C(4min) => 1C/min => 64C => 2.5C/min => 155C => 5C/min => 250Cnot specified
I 1290.1271.1271.1303.1252.
ReferenceQiao, Xie, et al., 2008Pontes, de Olivera, et al., 2007Judpentienë and Mockutë, 2004Sotomayor, Martínez, et al., 2004Vinogradov, 2004
Comment MSDC-RI MSDC-RI MSDC-RI MSDC-RI MSDC-RI
Column type CapillaryCapillaryCapillaryCapillaryCapillary
Active phase HP-5OV-101BP-1DB-5CP Sil 5 CB
Column length (m) 30.50.50. 30.
Carrier gas HeN2  N2
Substrate
Column diameter (mm) 0.250.250.22 0.25
Phase thickness (μm) 0.25 0.25
Program 60C (4min) => 1C/min => 64C => 2.5C/min => 155C => 5C/min => 250Cnot specifiednot specifiednot specifiednot specified
I 1291.1252.1247.1271.1248.
ReferenceJordán, Martínez, et al., 2003Yang, 2001Muselli, Bighelli, et al., 2000Isidorov, Zenkevich, et al., 1997Weyerstahl, Marschall, et al., 1997
Comment MSDC-RI MSDC-RI MSDC-RI MSDC-RI MSDC-RI
Column type CapillaryPacked
Active phase Polydimethyl siloxanesOV-101
Column length (m)  2.5
Carrier gas  N2
Substrate  Chromosorb G 60-80mesh DMCS
Column diameter (mm)
Phase thickness (μm)
Program not specifiednot specified
I 1252.1253.
ReferenceZenkevich, 1997Swigar and Silverstein, 1981
Comment MSDC-RI MSDC-RI

Kovats' RI, non-polar column, temperature ramp

Data compiled by: NIST Mass Spectrometry Data Center, William E. Wallace, director

Column type CapillaryCapillary
Active phase CP Sil 5 CBOV-101
Column length (m) 25.50.
Carrier gas  N2
Substrate
Column diameter (mm) 0.250.25
Phase thickness (μm)  0.2
Tstart (C) 60.80.
Tend (C) 280.200.
Heat rate (K/min) 5.2.
Initial hold (min)
Final hold (min)  60.
I 1271.1254.
ReferenceKaul and Vats, 1998Padrayuttawat, Tamura, et al., 1996
Comment MSDC-RI MSDC-RI

References

Bunau, Schade, et al., 1967
Bunau, G.v.; Schade, G.; Gollnick, K.,
Massenspektrometrische Untersuchungen von Terpenen. I.Monoterpenaldehyde und -ketone,
Z. Anal. Chem., 1967, 227, 173. [all data]