Benzene, 1,1'-cyclohexylidenebis-
- Formula: C18H20
- Molecular weight: 236.3514
- IUPAC Standard InChIKey: WLHJCCUFRCTNRZ-UHFFFAOYSA-N
- CAS Registry Number: 21113-55-3
- Chemical structure:
View 3d structure (requires JavaScript / HTML 5) - Other names: Cyclohexane, 1,1-diphenyl-

Gas phase ion energetics data

Data compiled by: Sharon G. Lias, Rhoda D. Levin, and Sherif A. Kafafi
Ionization energy determinations
IE (eV) | Method | Reference |
---|---|---|
8.9 ± 0.2 | EI | Fortin, Forest, et al., 1973 |
Appearance energy determinations
Ion | AE (eV) | Other Products | Method | Reference | Comment |
---|---|---|---|---|---|
C9H7+ | 13.3 ± 0.4 | ? | EI | Fortin and Rousseau, 1973 | |
C13H9+ | 13.3 ± 0.4 | ? | EI | Fortin and Rousseau, 1973 | |
C14H10+ | 10.8 ± 0.4 | ? | EI | Fortin and Rousseau, 1973 | |
C14H12+ | 9.8 ± 0.4 | ? | EI | Fortin and Rousseau, 1973 | |
C15H13+ | 10.3 ± 0.4 | ? | EI | Fortin and Rousseau, 1973 |

References

Fortin, Forest, et al., 1973
Fortin, C.J.; Forest, M.; Vaziri, C.; Gravel, D.; Rousseau, Y.,
Spectrometrie de masse des cyclohexanones gem-diphenylees. I. Localisation de la charge positive,
Can. J. Chem., 1973, 51, 3445. [all data]
Fortin and Rousseau, 1973
Fortin, C.J.; Rousseau, Y.,
Spectrometrie de masse des cyclohexanones gem-diphenylees. II. Chaleurs de formation et structures possibles des principaux ions fragmentaires,
Can. J. Chem., 1973, 51, 3457. [all data]