2(1H)-Naphthalenone, octahydro-1-methyl-, (1α,4aβ,8aα)-
- Formula: C11H18O
- Molecular weight: 166.2600
- IUPAC Standard InChIKey: OATKSURGQMWHRL-UHFFFAOYSA-N
- CAS Registry Number: 21102-88-5
- Chemical structure:
View 3d structure (requires JavaScript / HTML 5) - Other names: 2(1H)-Naphthalenone, octahydro-1-methyl-, anti-trans-; 1-Methyl-2-decalone; 2(1H)-Naphthalenone, octahydro-1-methyl-, (1α,4aβ,8a.al; Bicyclo[4.4.0]decan-3-one,2-methyl-; 2(1H)-Naphthalenone, octahydro-1-methyl-

Gas phase ion energetics data

Data compiled by: Sharon G. Lias, Rhoda D. Levin, and Sherif A. Kafafi
Ionization energy determinations
IE (eV) | Method | Reference |
---|---|---|
9.32 ± 0.08 | EI | Jaudon and Tabet, 1980 |
Appearance energy determinations
Ion | AE (eV) | Other Products | Method | Reference | Comment |
---|---|---|---|---|---|
C9H14O+ | 10.50 ± 0.08 | C2H4 | EI | Jaudon and Tabet, 1980 |

References

Jaudon and Tabet, 1980
Jaudon, P.; Tabet, J.-C.,
Rearrangement of molecular ions following electron impact. IV-Origin of the [M-28]+ ions in the mass spectra of α-methyl-2-decalone,
Org. Mass Spectrom., 1980, 15, 65. [all data]