Metribuzin
- Formula: C8H14N4OS
- Molecular weight: 214.288
- IUPAC Standard InChIKey: FOXFZRUHNHCZPX-UHFFFAOYSA-N
- CAS Registry Number: 21087-64-9
- Chemical structure:
View 3d structure (requires JavaScript / HTML 5) - Other names: 1,2,4-Triazin-5(4H)-one, 4-amino-6-(1,1-dimethylethyl)-3-(methylthio)-; As-Triazin-5(4H)-one, 4-amino-6-tert-butyl-3-(methylthio)-; Bayer 6159; BAY 6159; BAY 6159 H; BAY 61597; BAY 94337; Lexone; Sencor; Sencorex; Metribuzine; 4-Amino-6-tert-butyl-3-methylthio-as-triazin-5-one; 4-Amino-6-tert-butyl-3-(methylthio)-1,2,4-triazin-5-one; 4-Amino-6-(1,1-dimethylethyl)-3-(methylthio)-1,2,4-triazin-5(4H)-one; BAY DIC 1468; BAYER 94337; Bayer 6159H; Bayer 6443H; DIC 1468; Sencoral; Sencorer; 1,2,4-Triazin-5-one, 4-amino-6-tert-butyl-3-(methylthio)-; Zenkor; 4-Amino-6-tert-butyl-3-(methylthio)-as-triazin-5(4H)-one; Lexone 4L; Lexone 75DF; Lexone DF; Sencor 4L; Sencor 75DF; Sencor DF; Triazin-5(4H)-one, 4-amino-6-tert-butyl-3-(methylthio)-; 3-Methylthio-4-amino-6-tert-butyl-1,2,4-triazin-5-one; Sencor 4F; Sencorex L.F.; Senkor; Metoribuzine

Phase change data

Data compiled as indicated in comments:
TRC - Thermodynamics Research Center, NIST Boulder Laboratories, Chris Muzny director
AC - William E. Acree, Jr., James S. Chickos
Quantity | Value | Units | Method | Reference | Comment |
---|---|---|---|---|---|
Tfus | 399.94 | K | N/A | Donnelly, Drewes, et al., 1990 | Uncertainty assigned by TRC = 0.2 K; TRC |
Enthalpy of fusion
ΔfusH (kcal/mol) | Temperature (K) | Method | Reference | Comment |
---|---|---|---|---|
4.30 | 399.4 | DSC | Acree, 1991 | See also Donnelly, Drewes, et al., 1990, 2.; AC |

Kovats' RI, non-polar column, isothermal

Column type | Active phase | Temperature (C) | I | Reference | Comment |
---|---|---|---|---|---|
Capillary | OV-1 | 160. | 1819. | Erdmann, Rochholz, et al., 1992 | |
Capillary | OV-1 | 190. | 1835. | Erdmann, Rochholz, et al., 1992 | |
Capillary | OV-1 | 220. | 1849. | Erdmann, Rochholz, et al., 1992 |

Van Den Dool and Kratz RI, non-polar column, temperature ramp

Column type | Active phase | I | Reference | Comment |
---|---|---|---|---|
Capillary | SLB-5MS | 1873. | Mondello, Casilli, et al., 2007 | 30. m/0.25 mm/0.25 μm, He, 2. K/min; Tstart: 70. C; Tend: 300. C |
Capillary | SLB-5MS | 1882. | Mondello, Casilli, et al., 2007 | 30. m/0.25 mm/0.25 μm, He, 2. K/min; Tstart: 70. C; Tend: 300. C |

Normal alkane RI, non-polar column, custom temperature program

Column type | Active phase | I | Reference | Comment |
---|---|---|---|---|
Capillary | 5 % Phenyl methyl siloxane | 1888. | Department of Food Safety and Welfare, 2006 | 30. m/0.25 mm/0.25 μm, Helium; Program: 50 0C(1 min) 25 0C/min -> 125 0C 10 0C/min -> 300 0C (10 min) |
Capillary | Methyl Silicone | 1813. | Zenkevich, Ostroukhova, et al., 2002 | Program: not specified |

References

Donnelly, Drewes, et al., 1990
Donnelly, J.R.; Drewes, L.A.; Johnson, R.L.; Munslow, W.D.; Knapp, K.K.; Sovocool, G.W.,
Purity and heat of fusion data for environmental standards as determined by differential scanning calorimetry,
Thermochim. Acta, 1990, 167, 2, 155, https://doi.org/10.1016/0040-6031(90)80476-F
. [all data]
Acree, 1991
Acree, William E.,
Thermodynamic properties of organic compounds: enthalpy of fusion and melting point temperature compilation,
Thermochimica Acta, 1991, 189, 1, 37-56, https://doi.org/10.1016/0040-6031(91)87098-H
. [all data]
Donnelly, Drewes, et al., 1990, 2
Donnelly, J.R.; Drewes, L.A.; Johnson, R.L.; Munslow, W.D.; Knapp, K.K.; Sovocool, G.W.,
Purity and heat of fusion data for environmental standards as determined by differential scanning calorimetry,
Thermochimica Acta, 1990, 167, 2, 155-187, https://doi.org/10.1016/0040-6031(90)80476-F
. [all data]
Erdmann, Rochholz, et al., 1992
Erdmann, F.; Rochholz, G.; Schütz, H.,
Retention-indices on OV-1 of approximately 170 commonly used pesticides,
Mikrochim. Acta, 1992, 106, 3-6, 219-226, https://doi.org/10.1007/BF01242093
. [all data]
Mondello, Casilli, et al., 2007
Mondello, L.; Casilli, A.; Tranchida, P.Q.; Presti, M.L.; Dugo, P.; Dugo, G.,
Comprehensive gas chromatography coupled to mass spectrometry for the separation of pesticides in a very complex matrix,
Anal. Bioanal. Chem., 2007, 389, 6, 1755-1763, https://doi.org/10.1007/s00216-007-1412-y
. [all data]
Department of Food Safety and Welfare, 2006
Department of Food Safety, Ministry of Health; Welfare,
Analytical methods for residual compositional substances of agricultural chemicals, feed aadditives, and veterinary drugs in foods, 2006, retrieved from http://www.mhlw.go.jp/english/topics/foodsafety/positivelist060228/de/060526-1a.pdf. [all data]
Zenkevich, Ostroukhova, et al., 2002
Zenkevich, I.G.; Ostroukhova, O.K.; Dolzhenko, V.I.,
Optimum analytical parameters for chromatographic characterization of pesticides,
J. Anal. Chem. USSR (Engl. Transl.), 2002, 57, 1, 35-39. [all data]